program: Orca
programVersion: 5.0.2
elementType: S F F F F F O O O O O N N N N N C C C C C C C C C C C C C C C C H H H H H H H H H H H H H H
charge: 0
multiplicity: 1
keywords: wb97x-d3
keywords: def2-TZVPP
keywords: def2/J RIJCOSX
keywords: DEFGRID2
keywords: scfconv7
keywords: smallprint printgap noloewdin
keywords: NOSOSCF
formula: C16H14F5N5O5S
InChI: InChI=1/C16H14F5N5O5S/c1-29-10-6-22-15(30-2)26-13(10)23-14(24-26)25-32(27,28)12-8(16(19,20)21)4-3-5-9(12)31-7-11(17)18/h3-6,11,25H,7H2,1-2H3
46 atoms
S  -2.558783 -0.1490 0.423159
F  -3.895617 1.442263 -1.851029
F  -2.744486 2.524878 -3.281819
F  -2.359519 0.443343 -3.023848
F  2.250253 1.517169 2.40808
F  1.900236 1.36696 4.562275
O  -0.713441 1.229307 2.13683
O  -3.454528 0.23631 1.484648
O  -3.01552 -0.802613 -0.769455
O  3.741083 -1.906339 1.694857
O  1.242026 -2.023977 -3.083178
N  -1.452932 -1.193012 1.135835
N  1.230355 -1.799861 -0.84659
N  0.879383 -1.548227 1.293684
N  -0.092845 -1.603407 -0.75152
N  3.221746 -2.198159 -1.92177
C  -1.559328 1.284748 -0.042516
C  -1.652602 1.907822 -1.295164
C  -0.680188 1.80575 0.923569
C  -0.814975 2.975631 -1.585716
C  -0.237181 -1.454668 0.543905
C  0.164322 2.861915 0.6025
C  -2.672742 1.548357 -2.362897
C  1.807735 -1.773187 0.390064
C  0.094295 3.430921 -0.650244
C  3.211048 -1.960019 0.467952
C  1.952368 -2.01757 -1.981506
C  0.02906 1.70406 3.235188
C  3.854771 -2.167439 -0.719424
C  1.391155 1.039314 3.345339
C  5.135064 -2.065261 1.802761
C  1.936587 -2.273799 -4.296087
H  -1.400895 -1.094041 2.139411
H  -0.869668 3.467811 -2.543413
H  0.883962 3.240728 1.310834
H  0.752832 4.251915 -0.898081
H  0.126207 2.794312 3.240948
H  -0.552566 1.428246 4.116096
H  4.924702 -2.320571 -0.766073
H  1.347386 -0.045893 3.243206
H  5.463755 -3.04492 1.441878
H  5.375976 -1.982885 2.859266
H  5.678068 -1.287915 1.256208
H  1.180355 -2.244884 -5.074693
H  2.693141 -1.512442 -4.485908
H  2.418395 -3.251543 -4.284447
totalener: -2165.59032528 hartree
nucrepener: 3941.32884195 hartree
electener: -6106.91916723 hartree
twoeener: 4716.84673653 hartree
kineticenergy: 2158.29165686 hartree
xcener: -174.623320095625 hartree
chargesum: 0.0000000
charge: 0.836889 -0.155667 -0.179796 -0.141554 -0.205605 -0.202802 -0.298576 -0.442285 -0.407276 -0.284788 -0.242814 -0.180909 0.167176 -0.383866 -0.324211 -0.369906 -0.253741 -0.012181 0.383921 -0.123868 0.269349 -0.167645 0.536163 0.191300 -0.135391 0.154686 0.391185 -0.051894 -0.050730 0.320486 -0.146856 -0.122589 0.161569 0.130296 0.113053 0.134400 0.104673 0.128779 0.098509 0.089660 0.103278 0.121344 0.103483 0.130641 0.106502 0.107609
qa: 0.8369 -0.1557 -0.1798 -0.1416 -0.2056 -0.2028 -0.2986 -0.4423 -0.4073 -0.2848 -0.2428 -0.1809 0.1672 -0.3839 -0.3242 -0.3699 -0.2537 -0.0122 0.3839 -0.1239 0.2693 -0.1676 0.5362 0.1913 -0.1354 0.1547 0.3912 -0.0519 -0.0507 0.3205 -0.1469 -0.1226 0.1616 0.1303 0.1131 0.1344 0.1047 0.1288 0.0985 0.0897 0.1033 0.1213 0.1035 0.1306 0.1065 0.1076
va: 5.8764 1.1534 1.1154 1.1640 1.0617 1.0847 2.0927 2.0597 2.0838 2.0907 2.1761 3.1073 3.3669 3.0473 2.7650 3.0853 3.8885 3.7939 3.7072 3.9791 4.1451 3.9836 4.4569 4.0301 4.0050 3.9303 4.1374 3.8927 4.0351 4.0707 3.9015 3.8665 1.0464 1.0182 1.0358 1.0008 1.0101 1.0010 1.0138 1.0084 0.9858 0.9985 0.9862 0.9919 0.9989 0.9994
dispcorr: -0.027065461 hartree
energy: -2165.617390743652
dipole: 30.56861 -27.25760 3.31100 -8.72906 9.23290 0.50383 2.89415 -2.64247 0.25169
magnitude: 3.35856 au
magnitude: 8.53679 debye
