program: Orca
programVersion: 5.0.2
elementType: S F F F F F O O O O O N N N N N C C C C C C C C C C C C C C C C H H H H H H H H H H H H H H
charge: 0
multiplicity: 1
keywords: wb97x-d3
keywords: def2-TZVPP
keywords: def2/J RIJCOSX
keywords: DEFGRID2
keywords: scfconv7
keywords: smallprint printgap noloewdin
keywords: NOSOSCF
formula: C16H14F5N5O5S
InChI: InChI=1/C16H14F5N5O5S/c1-29-10-6-22-15(30-2)26-13(10)23-14(24-26)25-32(27,28)12-8(16(19,20)21)4-3-5-9(12)31-7-11(17)18/h3-6,11,25H,7H2,1-2H3
46 atoms
S  -1.862093 1.24276 -1.373379
F  -4.59264 0.180394 -0.153554
F  -3.437829 -1.649365 -0.335668
F  -4.52597 -1.232393 1.445865
F  3.361113 3.16639 1.458883
F  2.32974 1.235977 1.525391
O  0.019749 2.468137 0.393742
O  -2.636484 0.204925 -1.990752
O  -2.162812 2.640212 -1.568021
O  0.483685 -3.874944 0.239404
O  4.417508 -0.326267 -0.810343
N  -0.288096 1.067628 -1.940086
N  2.250823 -0.911963 -0.909364
N  0.074213 -1.104408 -1.034481
N  1.838496 0.254202 -1.434307
N  3.766424 -2.390294 -0.021484
C  -1.73225 0.917237 0.398811
C  -2.594417 0.053919 1.0925
C  -0.729204 1.604113 1.103457
C  -2.405929 -0.140447 2.453062
C  0.535805 0.069898 -1.483259
C  -0.548604 1.376487 2.462876
C  -3.785927 -0.663874 0.481556
C  1.175938 -1.72532 -0.662554
C  -1.385929 0.506792 3.123617
C  1.437386 -2.992466 -0.08386
C  3.516899 -1.250013 -0.55935
C  1.089541 3.181108 0.96568
C  2.749923 -3.256884 0.197059
C  2.399649 2.417711 0.860436
C  -0.594953 -4.062624 -0.668648
C  5.755505 -0.620027 -0.431296
H  0.170533 1.951809 -2.108878
H  -3.055832 -0.79822 3.00662
H  0.238938 1.861456 3.017815
H  -1.245493 0.331837 4.181268
H  1.178454 4.098103 0.381004
H  0.897955 3.481043 1.999794
H  3.018122 -4.204366 0.64711
H  2.691233 2.206714 -0.168262
H  -1.261696 -3.202972 -0.700379
H  -1.141593 -4.930603 -0.307647
H  -0.23478 -4.270118 -1.679525
H  6.134078 -1.497507 -0.95508
H  6.336124 0.254486 -0.709465
H  5.834958 -0.790819 0.642206
totalener: -2165.58853205 hartree
nucrepener: 4013.90395643 hartree
electener: -6179.49248848 hartree
twoeener: 4789.10977497 hartree
kineticenergy: 2158.31131886 hartree
xcener: -174.629886988726 hartree
chargesum: 0.0000000
charge: 0.840986 -0.153612 -0.147279 -0.178006 -0.201436 -0.205358 -0.294415 -0.413865 -0.443555 -0.304773 -0.267586 -0.172061 0.163086 -0.373023 -0.378968 -0.364654 -0.246824 -0.023884 0.386765 -0.124054 0.249518 -0.174733 0.540009 0.253491 -0.114778 0.098954 0.399424 -0.047745 -0.038100 0.316763 -0.123436 -0.122408 0.158990 0.132021 0.111086 0.134956 0.127194 0.103028 0.119959 0.087612 0.124901 0.112760 0.102696 0.115154 0.123372 0.111830
qa: 0.8410 -0.1536 -0.1473 -0.1780 -0.2014 -0.2054 -0.2944 -0.4139 -0.4436 -0.3048 -0.2676 -0.1721 0.1631 -0.3730 -0.3790 -0.3647 -0.2468 -0.0239 0.3868 -0.1241 0.2495 -0.1747 0.5400 0.2535 -0.1148 0.0990 0.3994 -0.0477 -0.0381 0.3168 -0.1234 -0.1224 0.1590 0.1320 0.1111 0.1350 0.1272 0.1030 0.1200 0.0876 0.1249 0.1128 0.1027 0.1152 0.1234 0.1118
va: 5.8750 1.1555 1.1454 1.1170 1.0872 1.0593 2.1037 2.0813 2.0577 2.0795 2.1458 3.1283 3.3973 3.0115 2.8054 3.0721 3.8770 3.7984 3.6982 3.9865 4.2153 3.9861 4.4269 3.8166 3.9843 3.9071 4.1248 3.9145 4.0808 4.0613 3.8539 3.8636 1.0465 1.0181 1.0273 1.0002 0.9979 1.0088 1.0101 1.0022 0.9885 0.9948 0.9942 1.0000 0.9928 0.9993
dispcorr: -0.029552367 hartree
energy: -2165.618084421210
dipole: 24.85984 -22.53799 2.32185 -6.53499 6.62602 0.09104 2.84186 -1.42860 1.41326
magnitude: 2.71967 au
magnitude: 6.91284 debye
