program: Orca
programVersion: 5.0.2
elementType: S F F F F F O O O O O N N N N N C C C C C C C C C C C C C C C C H H H H H H H H H H H H H H
charge: 0
multiplicity: 1
keywords: wb97x-d3
keywords: def2-TZVPP
keywords: def2/J RIJCOSX
keywords: DEFGRID2
keywords: scfconv7
keywords: smallprint printgap noloewdin
keywords: NOSOSCF
formula: C16H14F5N5O5S
InChI: InChI=1/C16H14F5N5O5S/c1-29-10-6-22-15(30-2)26-13(10)23-14(24-26)25-32(27,28)12-8(16(19,20)21)4-3-5-9(12)31-7-11(17)18/h3-6,11,25H,7H2,1-2H3
46 atoms
S  -1.838877 1.205219 -1.388555
F  -4.592679 0.227435 -0.325708
F  -3.528051 -1.664996 -0.313238
F  -4.710394 -1.073705 1.359819
F  3.304291 3.141888 1.571263
F  2.276748 1.206316 1.576634
O  -0.013996 2.451302 0.438089
O  -2.550941 0.128033 -2.01554
O  -2.174199 2.589228 -1.619828
O  0.592321 -3.808331 0.397673
O  4.506869 -0.349018 -0.973534
N  -0.242173 1.073342 -1.892365
N  2.3271 -0.894269 -0.916873
N  0.14564 -1.067374 -0.930848
N  1.900484 0.261874 -1.45466
N  3.872233 -2.38269 -0.099035
C  -1.77627 0.912483 0.391491
C  -2.682536 0.076571 1.061908
C  -0.78435 1.58615 1.123869
C  -2.532817 -0.124786 2.426559
C  0.595194 0.087762 -1.4370
C  -0.636797 1.344501 2.484792
C  -3.875644 -0.610108 0.416247
C  1.258573 -1.689711 -0.59615
C  -1.507976 0.48926 3.121285
C  1.535323 -2.946446 -0.002463
C  3.607525 -1.248474 -0.64274
C  1.043322 3.159028 1.03882
C  2.858704 -3.226492 0.203467
C  2.357298 2.402367 0.939624
C  -0.566761 -3.968529 -0.410898
C  5.865165 -0.685164 -0.722796
H  0.196882 1.964963 -2.072162
H  -3.216073 -0.762406 2.963977
H  0.150041 1.807603 3.059554
H  -1.392739 0.303888 4.180288
H  1.137543 4.087755 0.473678
H  0.836927 3.437445 2.076128
H  3.140081 -4.169105 0.655706
H  2.669997 2.214123 -0.088017
H  -1.224964 -3.102798 -0.365672
H  -1.086399 -4.838944 -0.0172
H  -0.304948 -4.157603 -1.455012
H  6.444332 0.169866 -1.058732
H  6.042784 -0.859845 0.338168
H  6.163103 -1.574289 -1.278447
totalener: -2165.58888039 hartree
nucrepener: 4002.57564621 hartree
electener: -6168.16452660 hartree
twoeener: 4777.75107276 hartree
kineticenergy: 2158.28865118 hartree
xcener: -174.626691094231 hartree
chargesum: -0.0000000
charge: 0.841313 -0.153393 -0.149185 -0.177289 -0.199976 -0.203563 -0.295462 -0.415068 -0.444008 -0.304063 -0.265835 -0.169513 0.164264 -0.379167 -0.380814 -0.365634 -0.208509 -0.042998 0.368964 -0.119656 0.254567 -0.166214 0.538392 0.249636 -0.122826 0.101339 0.398340 -0.048797 -0.039151 0.315614 -0.116141 -0.121208 0.158803 0.131480 0.111496 0.134698 0.127660 0.102890 0.119812 0.087138 0.118434 0.112325 0.103611 0.123743 0.111177 0.112779
qa: 0.8413 -0.1534 -0.1492 -0.1773 -0.2000 -0.2036 -0.2955 -0.4151 -0.4440 -0.3041 -0.2658 -0.1695 0.1643 -0.3792 -0.3808 -0.3656 -0.2085 -0.0430 0.3690 -0.1197 0.2546 -0.1662 0.5384 0.2496 -0.1228 0.1013 0.3983 -0.0488 -0.0392 0.3156 -0.1161 -0.1212 0.1588 0.1315 0.1115 0.1347 0.1277 0.1029 0.1198 0.0871 0.1184 0.1123 0.1036 0.1237 0.1112 0.1128
va: 5.8751 1.1568 1.1413 1.1183 1.0896 1.0616 2.1026 2.0790 2.0570 2.0815 2.1462 3.1348 3.3923 3.0123 2.8004 3.0726 3.8511 3.8093 3.7226 3.9827 4.2137 3.9834 4.4313 3.8261 3.9950 3.9116 4.1253 3.9083 4.0801 4.0656 3.8584 3.8653 1.0462 1.0176 1.0264 1.0004 0.9980 1.0092 1.0099 1.0011 0.9889 0.9945 0.9952 0.9926 0.9991 1.0000
dispcorr: -0.029350419 hartree
energy: -2165.618230811664
dipole: 25.20250 -22.95247 2.25003 -6.67857 6.80615 0.12759 3.06230 -1.61942 1.44288
magnitude: 2.67597 au
magnitude: 6.80179 debye
