program: Orca
programVersion: 5.0.2
elementType: S F F F F F O O O O O N N N N N C C C C C C C C C C C C C C C C H H H H H H H H H H H H H H
charge: 0
multiplicity: 1
keywords: wb97x-d3
keywords: def2-TZVPP
keywords: def2/J RIJCOSX
keywords: DEFGRID2
keywords: scfconv7
keywords: smallprint printgap noloewdin
keywords: NOSOSCF
formula: C16H14F5N5O5S
InChI: InChI=1/C16H14F5N5O5S/c1-29-10-6-22-15(30-2)26-13(10)23-14(24-26)25-32(27,28)12-8(16(19,20)21)4-3-5-9(12)31-7-11(17)18/h3-6,11,25H,7H2,1-2H3
46 atoms
S  -0.640879 0.859567 1.77203
F  -4.544505 -0.779091 -0.056715
F  -2.919616 -1.669119 0.992187
F  -3.74453 0.228793 1.648129
F  -0.067859 5.963351 0.033516
F  -1.618217 4.414459 -0.002208
O  0.458436 2.447793 -0.3477
O  -0.625608 2.183865 2.350226
O  -1.236512 -0.253628 2.453843
O  0.100537 -3.918864 -1.616417
O  4.964152 -1.921244 -0.368363
N  0.968186 0.497176 1.532777
N  2.721567 -1.830209 -0.176993
N  0.601196 -1.433804 0.191877
N  2.713949 -0.737437 0.604304
N  3.670806 -3.499235 -1.434883
C  -1.316714 0.957336 0.106375
C  -2.459693 0.265479 -0.323171
C  -0.630992 1.778074 -0.792015
C  -2.827118 0.347038 -1.658294
C  1.423961 -0.560827 0.785961
C  -1.006038 1.831405 -2.127607
C  -3.402704 -0.499288 0.590115
C  1.437775 -2.249883 -0.423151
C  -2.093165 1.10442 -2.555862
C  1.273294 -3.393798 -1.245643
C  3.809264 -2.459998 -0.691233
C  0.575563 3.829143 -0.614474
C  2.431149 -3.963648 -1.705901
C  -0.318656 4.653258 0.292515
C  -1.093434 -3.543867 -0.949673
C  6.125275 -2.549254 -0.892839
H  1.60886 1.264556 1.670416
H  -3.702145 -0.173273 -2.014296
H  -0.44245 2.431159 -2.829638
H  -2.386994 1.134577 -3.59594
H  1.617585 4.084437 -0.421371
H  0.361409 4.078103 -1.659042
H  2.376291 -4.840409 -2.338762
H  -0.160216 4.459186 1.35288
H  -1.365815 -2.509623 -1.156008
H  -1.023274 -3.676938 0.130386
H  -1.86532 -4.203426 -1.339269
H  6.211168 -3.580383 -0.549826
H  6.123691 -2.544311 -1.983047
H  6.964332 -1.967343 -0.52308
totalener: -2165.58756819 hartree
nucrepener: 3910.24998204 hartree
electener: -6075.83755023 hartree
twoeener: 4685.55547270 hartree
kineticenergy: 2158.29688055 hartree
xcener: -174.629756601734 hartree
chargesum: -0.0000000
charge: 0.869723 -0.178150 -0.149859 -0.152835 -0.202364 -0.191291 -0.326837 -0.476146 -0.417920 -0.289921 -0.254970 -0.181279 0.138638 -0.406074 -0.326999 -0.367018 -0.100301 -0.074489 0.208676 -0.110246 0.281173 -0.139268 0.552768 0.213345 -0.090155 0.149320 0.385553 -0.027859 -0.054094 0.313824 -0.090132 -0.119294 0.164264 0.133728 0.122814 0.136277 0.112241 0.092495 0.116589 0.088680 0.075392 0.116819 0.114334 0.109444 0.107087 0.124321
qa: 0.8697 -0.1781 -0.1499 -0.1528 -0.2024 -0.1913 -0.3268 -0.4761 -0.4179 -0.2899 -0.2550 -0.1813 0.1386 -0.4061 -0.3270 -0.3670 -0.1003 -0.0745 0.2087 -0.1102 0.2812 -0.1393 0.5528 0.2133 -0.0902 0.1493 0.3856 -0.0279 -0.0541 0.3138 -0.0901 -0.1193 0.1643 0.1337 0.1228 0.1363 0.1122 0.0925 0.1166 0.0887 0.0754 0.1168 0.1143 0.1094 0.1071 0.1243
va: 5.8558 1.1168 1.1461 1.1584 1.0844 1.0805 2.0101 2.0166 2.0857 2.1047 2.1624 3.1425 3.4391 3.0249 2.8667 3.0694 3.8904 3.7385 3.8183 3.9254 4.2291 4.0405 4.4193 3.8725 3.9626 3.9094 4.1454 3.8908 4.0714 4.0917 3.8776 3.8679 1.0435 1.0172 1.0046 0.9986 1.0042 1.0111 1.0112 0.9965 0.9979 0.9979 0.9930 0.9996 0.9998 0.9925
dispcorr: -0.027970853 hartree
energy: -2165.615539041175
dipole: 25.86259 -24.24321 1.61937 -13.34017 13.27801 -0.06216 -16.64241 14.31028 -2.33213
magnitude: 2.83990 au
magnitude: 7.21846 debye
