program: Orca
programVersion: 5.0.2
elementType: S F F F F F O O O O O N N N N N C C C C C C C C C C C C C C C C H H H H H H H H H H H H H H
charge: 0
multiplicity: 1
keywords: wb97x-d3
keywords: def2-TZVPP
keywords: def2/J RIJCOSX
keywords: DEFGRID2
keywords: scfconv7
keywords: smallprint printgap noloewdin
keywords: NOSOSCF
formula: C16H14F5N5O5S
InChI: InChI=1/C16H14F5N5O5S/c1-29-10-6-22-15(30-2)26-13(10)23-14(24-26)25-32(27,28)12-8(16(19,20)21)4-3-5-9(12)31-7-11(17)18/h3-6,11,25H,7H2,1-2H3
46 atoms
S  -2.065136 -1.18769 0.429352
F  -4.015914 2.013084 -2.187001
F  -3.216115 0.044449 -2.16979
F  -4.822433 0.578388 -0.824253
F  2.224809 0.583041 4.518011
F  0.477894 1.896224 4.654945
O  -0.749426 0.41878 2.593441
O  -1.363522 -1.821667 1.510563
O  -3.40034 -1.600633 0.078469
O  3.395536 0.434848 0.91586
O  2.988547 -2.428436 -3.634882
N  -1.180895 -1.407453 -0.975884
N  2.083046 -1.437839 -1.830118
N  0.911638 -0.597279 -0.185626
N  0.821941 -1.818392 -2.091751
N  4.35335 -1.303921 -2.163424
C  -2.027481 0.609483 0.593757
C  -2.700064 1.458591 -0.313854
C  -1.268919 1.180812 1.623186
C  -2.523251 2.828403 -0.215734
C  0.176493 -1.285943 -1.076506
C  -1.10792 2.564916 1.692603
C  -3.689473 1.0014 -1.372074
C  2.12659 -0.712941 -0.674007
C  -1.715213 3.377364 0.769212
C  3.393276 -0.254859 -0.231252
C  3.202258 -1.718469 -2.552157
C  0.645562 0.427391 2.811984
C  4.461277 -0.581469 -1.01821
C  0.887086 0.655024 4.283801
C  4.641217 0.819215 1.447541
C  4.128655 -2.768871 -4.411919
H  -1.66696 -1.876508 -1.72645
H  -3.027262 3.49302 -0.899092
H  -0.529216 2.984769 2.504274
H  -1.594123 4.450536 0.826919
H  1.052908 -0.54026 2.516842
H  1.155024 1.19326 2.221286
H  5.46841 -0.278931 -0.76378
H  0.378874 -0.07208 4.920279
H  5.161832 1.527899 0.796539
H  5.29097 -0.043423 1.622945
H  4.432982 1.299905 2.399776
H  4.636688 -1.879586 -4.785188
H  4.839271 -3.362326 -3.836606
H  3.749561 -3.353584 -5.244814
totalener: -2165.58889738 hartree
nucrepener: 3854.72288761 hartree
electener: -6020.31178499 hartree
twoeener: 4630.34926773 hartree
kineticenergy: 2158.29662682 hartree
xcener: -174.627132419787 hartree
chargesum: 0.0000000
charge: 0.837044 -0.174794 -0.172663 -0.143891 -0.208306 -0.206289 -0.306200 -0.413735 -0.442162 -0.296101 -0.250675 -0.199206 0.139317 -0.396010 -0.328703 -0.369730 -0.150865 -0.097868 0.271933 -0.098869 0.319963 -0.117664 0.538108 0.176681 -0.127783 0.170725 0.391011 0.015351 -0.048867 0.307614 -0.134791 -0.120551 0.172423 0.134878 0.138246 0.136117 0.108968 0.096347 0.098716 0.084301 0.105611 0.105950 0.112305 0.108437 0.108566 0.127112
qa: 0.8370 -0.1748 -0.1727 -0.1439 -0.2083 -0.2063 -0.3062 -0.4137 -0.4422 -0.2961 -0.2507 -0.1992 0.1393 -0.3960 -0.3287 -0.3697 -0.1509 -0.0979 0.2719 -0.0989 0.3200 -0.1177 0.5381 0.1767 -0.1278 0.1707 0.3910 0.0154 -0.0489 0.3076 -0.1348 -0.1206 0.1724 0.1349 0.1382 0.1361 0.1090 0.0963 0.0987 0.0843 0.1056 0.1059 0.1123 0.1084 0.1086 0.1271
va: 5.8962 1.1240 1.1289 1.1602 1.0724 1.0698 2.0553 2.0924 2.0535 2.0926 2.1692 3.1168 3.4417 3.0811 2.8576 3.0843 3.8484 3.8776 3.9154 3.9379 4.1939 3.9531 4.4318 4.0646 3.9675 3.8908 4.1395 3.8187 4.0471 4.1566 3.8906 3.8660 1.0333 1.0166 1.0228 1.0002 1.0223 1.0185 1.0120 0.9840 0.9849 0.9881 1.0060 0.9992 0.9998 0.9925
dispcorr: -0.026697839 hartree
energy: -2165.615595214811
dipole: 36.28918 -33.50521 2.78397 -1.17304 2.28991 1.11687 -3.71365 2.98048 -0.73317
magnitude: 3.08795 au
magnitude: 7.84895 debye
