program: Orca
programVersion: 5.0.2
elementType: S F F F F F O O O O O N N N N N C C C C C C C C C C C C C C C C H H H H H H H H H H H H H H
charge: 0
multiplicity: 1
keywords: wb97x-d3
keywords: def2-TZVPP
keywords: def2/J RIJCOSX
keywords: DEFGRID2
keywords: scfconv7
keywords: smallprint printgap noloewdin
keywords: NOSOSCF
formula: C16H14F5N5O5S
InChI: InChI=1/C16H14F5N5O5S/c1-29-10-6-22-15(30-2)26-13(10)23-14(24-26)25-32(27,28)12-8(16(19,20)21)4-3-5-9(12)31-7-11(17)18/h3-6,11,25H,7H2,1-2H3
46 atoms
S  -1.326868 0.658665 1.697886
F  -4.844335 1.016674 1.575192
F  -5.506766 -0.11119 -0.110439
F  -3.982591 -0.930583 1.134846
F  2.926497 1.540352 -1.036297
F  2.956416 3.510422 -0.083786
O  0.2053 1.381872 -0.706358
O  -0.208861 1.53951 1.911883
O  -2.408164 0.613459 2.643977
O  1.477453 -3.30476 -2.76309
O  4.250932 -0.41688 0.865569
N  -0.739624 -0.90262 1.600939
N  2.307517 -1.293958 0.15353
N  0.271936 -1.95251 -0.281539
N  1.576259 -0.791375 1.156072
N  4.222888 -1.678792 -1.057055
C  -2.012732 0.98621 0.049481
C  -3.37494 0.857404 -0.279374
C  -1.121583 1.427842 -0.934368
C  -3.814404 1.293105 -1.520888
C  0.3750 -1.204442 0.830179
C  -1.584114 1.854746 -2.173458
C  -4.42356 0.215801 0.607563
C  1.516474 -2.007503 -0.708703
C  -2.93026 1.811091 -2.453083
C  2.146631 -2.617202 -1.823249
C  3.644571 -1.136936 -0.046268
C  0.883157 2.622003 -0.636496
C  3.4928 -2.414495 -1.928788
C  2.279439 2.334701 -0.140411
C  0.540661 -4.273321 -2.317433
C  5.634463 -0.160616 0.66216
H  -1.486255 -1.582302 1.516206
H  -4.857397 1.214276 -1.785139
H  -0.874685 2.189118 -2.919085
H  -3.297633 2.142187 -3.414564
H  0.937384 3.10473 -1.619524
H  0.388742 3.30284 0.060533
H  4.035115 -2.844122 -2.76167
H  2.299617 1.851858 0.83642
H  0.989882 -4.96583 -1.59988
H  0.239197 -4.833707 -3.199483
H  -0.33828 -3.815113 -1.864173
H  6.212827 -1.08408 0.656405
H  5.802856 0.368112 -0.275544
H  5.940695 0.461949 1.497409
totalener: -2165.58828109 hartree
nucrepener: 3953.00710124 hartree
electener: -6118.59538233 hartree
twoeener: 4728.35541248 hartree
kineticenergy: 2158.29720336 hartree
xcener: -174.616643555359 hartree
chargesum: -0.0000000
charge: 0.860464 -0.142005 -0.173670 -0.178183 -0.206657 -0.204031 -0.306576 -0.439773 -0.431693 -0.307323 -0.256393 -0.172722 0.186767 -0.368866 -0.304773 -0.354083 -0.244415 0.016420 0.264669 -0.118816 0.200121 -0.178778 0.547251 0.246967 -0.091408 0.080694 0.384494 -0.012754 -0.031001 0.294899 -0.120686 -0.128055 0.156968 0.133309 0.140542 0.136493 0.099485 0.115782 0.118680 0.102679 0.099643 0.114316 0.113755 0.116439 0.115150 0.126675
qa: 0.8605 -0.1420 -0.1737 -0.1782 -0.2067 -0.2040 -0.3066 -0.4398 -0.4317 -0.3073 -0.2564 -0.1727 0.1868 -0.3689 -0.3048 -0.3541 -0.2444 0.0164 0.2647 -0.1188 0.2001 -0.1788 0.5473 0.2470 -0.0914 0.0807 0.3845 -0.0128 -0.0310 0.2949 -0.1207 -0.1281 0.1570 0.1333 0.1405 0.1365 0.0995 0.1158 0.1187 0.1027 0.0996 0.1143 0.1138 0.1164 0.1151 0.1267
va: 5.8821 1.1640 1.1243 1.1207 1.0498 1.0842 1.9989 2.0586 2.0782 2.0713 2.1553 3.0585 3.3245 3.0212 2.7543 3.0630 4.0225 3.7421 3.8470 3.9824 4.2583 4.1003 4.4209 3.8403 3.9703 3.9029 4.1400 3.8585 4.0906 4.1036 3.8501 3.8563 1.0487 1.0175 1.0007 0.9995 1.0103 1.0076 1.0096 1.0005 0.9927 0.9959 0.9991 1.0004 1.0007 0.9921
dispcorr: -0.028896975 hartree
energy: -2165.617178064969
dipole: 23.17343 -22.71654 0.45690 -9.12981 8.76333 -0.36648 -14.74795 12.74389 -2.00406
magnitude: 2.08789 au
magnitude: 5.30700 debye
