program: Orca
programVersion: 5.0.2
elementType: S F F F F F O O O O O N N N N N C C C C C C C C C C C C C C C C H H H H H H H H H H H H H H
charge: 0
multiplicity: 1
keywords: wb97x-d3
keywords: def2-TZVPP
keywords: def2/J RIJCOSX
keywords: DEFGRID2
keywords: scfconv7
keywords: smallprint printgap noloewdin
keywords: NOSOSCF
formula: C16H14F5N5O5S
InChI: InChI=1/C16H14F5N5O5S/c1-29-10-6-22-15(30-2)26-13(10)23-14(24-26)25-32(27,28)12-8(16(19,20)21)4-3-5-9(12)31-7-11(17)18/h3-6,11,25H,7H2,1-2H3
46 atoms
S  -1.35464 1.361264 -1.405266
F  -4.870564 -0.81809 0.569677
F  -4.312417 0.599341 -0.925676
F  -3.497211 -1.410923 -0.951363
F  2.23074 5.02862 1.719156
F  2.130435 3.83456 -0.114771
O  -0.014325 2.478835 0.836933
O  -1.972534 0.365749 -2.234973
O  -1.549173 2.773574 -1.616923
O  0.103812 -3.976877 0.29021
O  4.672778 -1.296515 -0.775682
N  0.296987 1.136368 -1.526967
N  2.423288 -1.368419 -0.727561
N  0.250939 -1.1147 -0.760893
N  2.240382 -0.10629 -1.155353
N  3.623676 -3.217388 -0.072548
C  -1.70496 0.964662 0.316636
C  -2.71829 0.093821 0.72718
C  -0.870901 1.548625 1.279668
C  -2.789185 -0.279782 2.062855
C  0.927614 -0.025102 -1.15715
C  -0.940823 1.150179 2.60793
C  -3.839234 -0.39045 -0.174401
C  1.214046 -1.969414 -0.491009
C  -1.886105 0.217708 2.983463
C  1.223969 -3.305452 -0.018264
C  3.601966 -2.007645 -0.509547
C  0.813003 3.182472 1.72354
C  2.457556 -3.863982 0.160498
C  1.400782 4.320616 0.91754
C  -0.91757 -4.007535 -0.700379
C  5.926437 -1.930905 -0.561999
H  0.853991 1.979394 -1.510231
H  -3.558874 -0.956266 2.399462
H  -0.267436 1.556718 3.349634
H  -1.939598 -0.104442 4.014095
H  0.24502 3.603703 2.560421
H  1.612889 2.549438 2.125748
H  2.538914 -4.879948 0.525938
H  0.635907 4.9868 0.512914
H  -1.674982 -4.696745 -0.334423
H  -0.533517 -4.381074 -1.653484
H  -1.367264 -3.028209 -0.856846
H  6.052091 -2.224146 0.480416
H  6.036974 -2.816038 -1.188127
H  6.67599 -1.19281 -0.830928
totalener: -2165.59040564 hartree
nucrepener: 3899.94540755 hartree
electener: -6065.53581319 hartree
twoeener: 4675.21832421 hartree
kineticenergy: 2158.31352826 hartree
xcener: -174.629381080589 hartree
chargesum: -0.0000000
charge: 0.847355 -0.177203 -0.155191 -0.148478 -0.194020 -0.194985 -0.294904 -0.418042 -0.447864 -0.312401 -0.250488 -0.191687 0.142874 -0.404570 -0.327492 -0.371698 -0.217394 -0.016425 0.361097 -0.126622 0.278789 -0.193160 0.541129 0.250247 -0.115129 0.079588 0.391022 -0.029353 -0.029529 0.293295 -0.116796 -0.119628 0.179325 0.127895 0.119909 0.134835 0.106857 0.116803 0.119905 0.086641 0.110439 0.099263 0.122625 0.107656 0.109906 0.125602
qa: 0.8474 -0.1772 -0.1552 -0.1485 -0.1940 -0.1950 -0.2949 -0.4180 -0.4479 -0.3124 -0.2505 -0.1917 0.1429 -0.4046 -0.3275 -0.3717 -0.2174 -0.0164 0.3611 -0.1266 0.2788 -0.1932 0.5411 0.2502 -0.1151 0.0796 0.3910 -0.0294 -0.0295 0.2933 -0.1168 -0.1196 0.1793 0.1279 0.1199 0.1348 0.1069 0.1168 0.1199 0.0866 0.1104 0.0993 0.1226 0.1077 0.1099 0.1256
va: 5.8894 1.1190 1.1553 1.1430 1.0936 1.0817 2.1000 2.0803 2.0519 2.0657 2.1688 3.1401 3.4110 3.0330 2.8453 3.0633 3.8906 3.7608 3.7347 4.0108 4.2070 3.9897 4.4284 3.8407 4.0107 3.8997 4.1484 3.8578 4.0882 4.1788 3.8481 3.8656 1.0398 1.0170 1.0130 1.0002 0.9967 1.0006 1.0095 0.9854 0.9955 0.9949 0.9885 0.9999 0.9998 0.9926
dispcorr: -0.026719944 hartree
energy: -2165.617125579519
dipole: 22.52600 -21.02776 1.49824 -16.40680 15.85886 -0.54794 9.31401 -6.98701 2.32700
magnitude: 2.82133 au
magnitude: 7.17125 debye
