program: Orca
programVersion: 5.0.2
elementType: S F F F F F O O O O O N N N N N C C C C C C C C C C C C C C C C H H H H H H H H H H H H H H
charge: 0
multiplicity: 1
keywords: wb97x-d3
keywords: def2-TZVPP
keywords: def2/J RIJCOSX
keywords: DEFGRID2
keywords: scfconv7
keywords: smallprint printgap noloewdin
keywords: NOSOSCF
formula: C16H14F5N5O5S
InChI: InChI=1/C16H14F5N5O5S/c1-29-10-6-22-15(30-2)26-13(10)23-14(24-26)25-32(27,28)12-8(16(19,20)21)4-3-5-9(12)31-7-11(17)18/h3-6,11,25H,7H2,1-2H3
46 atoms
S  -0.797242 0.87378 1.775121
F  -2.938949 -1.687289 0.810963
F  -3.871798 0.196274 1.342088
F  -4.469098 -0.857872 -0.416969
F  0.273523 5.953724 -0.284176
F  -1.364468 4.585946 -0.766707
O  0.525621 2.391665 -0.24153
O  -0.825378 2.217069 2.307203
O  -1.473519 -0.206911 2.433383
O  0.211041 -4.012623 -1.411138
O  4.954019 -1.857919 0.023915
N  0.823607 0.481729 1.710623
N  2.703911 -1.820437 0.104007
N  0.560503 -1.473383 0.376128
N  2.635223 -0.717938 0.86803
N  3.753491 -3.481706 -1.082349
C  -1.294374 0.92888 0.04386
C  -2.389066 0.230279 -0.487801
C  -0.516825 1.733301 -0.795659
C  -2.624823 0.29497 -1.853197
C  1.334532 -0.572425 0.993313
C  -0.7645 1.774643 -2.161443
C  -3.406505 -0.538363 0.337963
C  1.442846 -2.275784 -0.192764
C  -1.806798 1.043472 -2.683067
C  1.34679 -3.435801 -1.004794
C  3.830137 -2.430014 -0.347456
C  0.821916 3.717429 -0.619868
C  2.539776 -3.979222 -1.405024
C  -0.201676 4.698432 -0.079704
C  -1.039328 -3.564436 -0.917747
C  6.154931 -2.468244 -0.425712
H  1.455163 1.249247 1.887164
H  -3.460002 -0.231425 -2.287186
H  -0.141537 2.367485 -2.816648
H  -2.000376 1.065774 -3.74656
H  1.792588 3.935827 -0.175178
H  0.922037 3.842121 -1.7033
H  2.535658 -4.866021 -2.026236
H  -0.407902 4.555051 0.982266
H  -1.093112 -3.608447 0.169595
H  -1.77907 -4.241264 -1.339007
H  -1.260871 -2.546601 -1.238502
H  6.960107 -1.862852 -0.01978
H  6.243332 -3.492182 -0.061862
H  6.213673 -2.479617 -1.514384
totalener: -2165.58709209 hartree
nucrepener: 3907.60878237 hartree
electener: -6073.19587446 hartree
twoeener: 4682.76180668 hartree
kineticenergy: 2158.29009981 hartree
xcener: -174.628396693002 hartree
chargesum: -0.0000000
charge: 0.865727 -0.149757 -0.152513 -0.178672 -0.199720 -0.191725 -0.314833 -0.471711 -0.416090 -0.286734 -0.255299 -0.179220 0.138964 -0.401246 -0.326221 -0.366110 -0.157314 -0.067539 0.244909 -0.117756 0.270332 -0.138121 0.554227 0.206488 -0.080857 0.161964 0.384626 -0.035546 -0.057805 0.315035 -0.091429 -0.119243 0.163141 0.133488 0.118713 0.136547 0.110730 0.098380 0.116284 0.089197 0.116520 0.114690 0.075012 0.124238 0.109215 0.107033
qa: 0.8657 -0.1498 -0.1525 -0.1787 -0.1997 -0.1917 -0.3148 -0.4717 -0.4161 -0.2867 -0.2553 -0.1792 0.1390 -0.4012 -0.3262 -0.3661 -0.1573 -0.0675 0.2449 -0.1178 0.2703 -0.1381 0.5542 0.2065 -0.0809 0.1620 0.3846 -0.0355 -0.0578 0.3150 -0.0914 -0.1192 0.1631 0.1335 0.1187 0.1365 0.1107 0.0984 0.1163 0.0892 0.1165 0.1147 0.0750 0.1242 0.1092 0.1070
va: 5.8594 1.1459 1.1586 1.1160 1.0874 1.0810 2.0323 2.0213 2.0858 2.1092 2.1616 3.1400 3.4403 3.0229 2.8637 3.0700 3.9225 3.7384 3.7941 3.9260 4.2356 4.0275 4.4162 3.8781 3.9464 3.9048 4.1458 3.9072 4.0718 4.0977 3.8795 3.8681 1.0444 1.0177 1.0058 0.9981 1.0071 1.0080 1.0115 0.9951 0.9985 0.9928 0.9982 0.9925 0.9999 0.9996
dispcorr: -0.028030876 hartree
energy: -2165.615122966662
dipole: 26.62541 -24.84159 1.78382 -13.55079 13.46962 -0.08118 -13.55525 11.38921 -2.16604
magnitude: 2.80719 au
magnitude: 7.13532 debye
