program: Orca
programVersion: 5.0.2
elementType: S F F F F F O O O O O N N N N N C C C C C C C C C C C C C C C C H H H H H H H H H H H H H H
charge: 0
multiplicity: 1
keywords: wb97x-d3
keywords: def2-TZVPP
keywords: def2/J RIJCOSX
keywords: DEFGRID2
keywords: scfconv7
keywords: smallprint printgap noloewdin
keywords: NOSOSCF
formula: C16H14F5N5O5S
InChI: InChI=1/C16H14F5N5O5S/c1-29-10-6-22-15(30-2)26-13(10)23-14(24-26)25-32(27,28)12-8(16(19,20)21)4-3-5-9(12)31-7-11(17)18/h3-6,11,25H,7H2,1-2H3
46 atoms
S  -1.503565 -0.12011 1.578401
F  -5.042795 0.300232 1.661282
F  -5.612018 0.732359 -0.349359
F  -4.145428 -0.77715 0.000865
F  2.832378 1.561197 -0.253185
F  3.244034 2.849734 1.467535
O  0.114994 1.830123 0.181399
O  -0.390099 0.361788 2.351046
O  -2.634898 -0.725802 2.227076
O  2.182198 -2.720356 -3.668776
O  4.103218 -0.910563 1.045134
N  -0.948209 -1.245503 0.486971
N  2.35907 -1.462723 -0.262412
N  0.467043 -1.850334 -1.28058
N  1.422345 -1.136991 0.64351
N  4.494851 -1.711116 -1.074658
C  -2.121819 1.239187 0.561545
C  -3.481338 1.464339 0.290381
C  -1.177429 2.180668 0.136457
C  -3.868744 2.688585 -0.234495
C  0.321988 -1.377773 -0.029345
C  -1.586316 3.408989 -0.371618
C  -4.568705 0.416925 0.430366
C  1.7755 -1.905265 -1.418602
C  -2.9309 3.667075 -0.522533
C  2.633332 -2.303069 -2.47438
C  3.70628 -1.364598 -0.120112
C  1.049394 2.744606 0.715267
C  3.971897 -2.184473 -2.230134
C  2.336982 1.98487 0.939486
C  1.172779 -3.717823 -3.665628
C  5.502111 -0.729924 1.220388
H  -1.673139 -1.675953 -0.071813
H  -4.908976 2.888105 -0.441124
H  -0.854218 4.145579 -0.674396
H  -3.256074 4.620476 -0.915806
H  1.237267 3.579954 0.031197
H  0.698953 3.144618 1.67103
H  4.683051 -2.463501 -2.997468
H  2.218657 1.126367 1.598735
H  1.473644 -4.589694 -3.077543
H  1.043109 -4.023694 -4.701234
H  0.225048 -3.340535 -3.281552
H  5.621681 -0.347193 2.229534
H  6.040963 -1.671097 1.114218
H  5.900139 -0.012375 0.503287
totalener: -2165.58833593 hartree
nucrepener: 3889.14594933 hartree
electener: -6054.73428526 hartree
twoeener: 4664.62982137 hartree
kineticenergy: 2158.28763050 hartree
xcener: -174.622112277743 hartree
chargesum: -0.0000000
charge: 0.853011 -0.141080 -0.173418 -0.179583 -0.208823 -0.210221 -0.297512 -0.431040 -0.434266 -0.308678 -0.263541 -0.180382 0.178429 -0.393736 -0.365432 -0.363535 -0.238381 -0.000207 0.278144 -0.119329 0.293445 -0.157794 0.546858 0.242615 -0.100645 0.078775 0.397398 -0.003654 -0.024433 0.292987 -0.118865 -0.127822 0.162682 0.130577 0.127287 0.136162 0.097186 0.116683 0.118525 0.107663 0.098099 0.113498 0.114192 0.125572 0.118021 0.114568
qa: 0.8530 -0.1411 -0.1734 -0.1796 -0.2088 -0.2102 -0.2975 -0.4310 -0.4343 -0.3087 -0.2635 -0.1804 0.1784 -0.3937 -0.3654 -0.3635 -0.2384 -0.0002 0.2781 -0.1193 0.2934 -0.1578 0.5469 0.2426 -0.1006 0.0788 0.3974 -0.0037 -0.0244 0.2930 -0.1189 -0.1278 0.1627 0.1306 0.1273 0.1362 0.0972 0.1167 0.1185 0.1077 0.0981 0.1135 0.1142 0.1256 0.1180 0.1146
va: 5.9013 1.1647 1.1242 1.1197 1.0559 1.0742 2.0697 2.0692 2.0695 2.0703 2.1531 3.1086 3.3301 3.0446 2.7410 3.0695 3.9739 3.7479 3.8800 3.9895 4.1869 4.0363 4.4295 3.8680 3.9724 3.8960 4.1337 3.8815 4.0887 4.1100 3.8499 3.8587 1.0450 1.0175 1.0037 0.9998 1.0084 1.0016 1.0097 1.0002 0.9925 0.9959 0.9993 0.9923 1.0009 0.9997
dispcorr: -0.027425927 hartree
energy: -2165.615761857252
dipole: 25.51637 -24.89963 0.61674 -3.49506 4.51368 1.01861 -11.20124 9.98177 -1.21947
magnitude: 1.70442 au
magnitude: 4.33229 debye
