program: Orca
programVersion: 5.0.2
elementType: S F F F F F O O O O O N N N N N C C C C C C C C C C C C C C C C H H H H H H H H H H H H H H
charge: 0
multiplicity: 1
keywords: wb97x-d3
keywords: def2-TZVPP
keywords: def2/J RIJCOSX
keywords: DEFGRID2
keywords: scfconv7
keywords: smallprint printgap noloewdin
keywords: NOSOSCF
formula: C16H14F5N5O5S
InChI: InChI=1/C16H14F5N5O5S/c1-29-10-6-22-15(30-2)26-13(10)23-14(24-26)25-32(27,28)12-8(16(19,20)21)4-3-5-9(12)31-7-11(17)18/h3-6,11,25H,7H2,1-2H3
46 atoms
S  -1.730128 1.208459 -1.136524
F  -4.319842 -1.150203 1.844088
F  -4.348383 0.213679 0.205369
F  -3.397422 -1.73055 0.0093
F  3.074372 4.437153 0.471512
F  2.061592 3.418454 -1.181125
O  0.187213 2.431763 0.599196
O  -2.550514 0.191124 -1.729133
O  -2.001412 2.613393 -1.306353
O  0.185347 -4.355527 -0.567284
O  4.179857 -0.786271 0.143951
N  -0.170388 0.977297 -1.727981
N  2.093434 -1.253591 -0.551898
N  0.020722 -1.349072 -1.244564
N  1.787222 0.013445 -0.872579
N  3.410536 -2.956445 0.245674
C  -1.519477 0.832253 0.620773
C  -2.296948 -0.09308 1.326265
C  -0.443863 1.458728 1.270699
C  -1.921646 -0.457373 2.612486
C  0.545604 -0.118314 -1.294202
C  -0.068261 1.063358 2.548844
C  -3.592686 -0.692605 0.813619
C  1.011708 -2.070427 -0.763899
C  -0.800845 0.095058 3.202427
C  1.160601 -3.447354 -0.456363
C  3.263189 -1.711886 -0.036927
C  1.446753 2.881811 1.034129
C  2.386681 -3.815716 0.027389
C  1.882459 3.947582 0.05421
C  -0.800259 -4.198153 -1.580752
C  5.425501 -1.219849 0.672177
H  0.369959 1.8318 -1.765192
H  -2.506683 -1.172252 3.169246
H  0.783722 1.50807 3.042902
H  -0.510738 -0.215105 4.196634
H  1.389836 3.339884 2.027969
H  2.176508 2.064319 1.051248
H  2.571242 -4.852503 0.278793
H  1.165963 4.768626 -0.026979
H  -0.347369 -4.045525 -2.562766
H  -1.476398 -3.370786 -1.373611
H  -1.360202 -5.129936 -1.593341
H  5.906861 -1.943243 0.013988
H  6.038138 -0.326132 0.746937
H  5.305292 -1.671113 1.657208
totalener: -2165.58915389 hartree
nucrepener: 3970.09998452 hartree
electener: -6135.68913842 hartree
twoeener: 4745.14704852 hartree
kineticenergy: 2158.31180919 hartree
xcener: -174.625110804293 hartree
chargesum: 0.0000000
charge: 0.836762 -0.177546 -0.153799 -0.147116 -0.194604 -0.195966 -0.298495 -0.410471 -0.442252 -0.296929 -0.262599 -0.199368 0.169167 -0.353837 -0.362289 -0.366598 -0.155449 -0.063013 0.305462 -0.106071 0.209574 -0.170391 0.537247 0.239788 -0.126207 0.117433 0.387978 -0.028815 -0.042415 0.291917 -0.119166 -0.120580 0.186108 0.130140 0.117165 0.135094 0.114299 0.123370 0.119700 0.087714 0.104352 0.122900 0.113410 0.112223 0.124943 0.107232
qa: 0.8368 -0.1775 -0.1538 -0.1471 -0.1946 -0.1960 -0.2985 -0.4105 -0.4423 -0.2969 -0.2626 -0.1994 0.1692 -0.3538 -0.3623 -0.3666 -0.1554 -0.0630 0.3055 -0.1061 0.2096 -0.1704 0.5372 0.2398 -0.1262 0.1174 0.3880 -0.0288 -0.0424 0.2919 -0.1192 -0.1206 0.1861 0.1301 0.1172 0.1351 0.1143 0.1234 0.1197 0.0877 0.1044 0.1229 0.1134 0.1122 0.1249 0.1072
va: 5.8759 1.1189 1.1581 1.1475 1.0935 1.0814 2.1006 2.0838 2.0577 2.0939 2.1497 3.1008 3.3774 3.0109 2.7742 3.0725 3.8246 3.8311 3.8062 3.9780 4.2372 3.9674 4.4350 3.7930 4.0119 3.9145 4.1337 3.8080 4.0653 4.1748 3.8593 3.8663 1.0466 1.0169 1.0126 1.0005 0.9986 1.0139 1.0105 0.9851 0.9951 0.9899 0.9929 1.0002 0.9919 0.9993
dispcorr: -0.028367578 hartree
energy: -2165.617521471306
dipole: 24.79622 -22.49567 2.30055 -13.06538 12.68594 -0.37944 6.76762 -4.63553 2.13209
magnitude: 3.15948 au
magnitude: 8.03075 debye
