program: Orca
programVersion: 5.0.2
elementType: S F F F F F O O O O O N N N N N C C C C C C C C C C C C C C C C H H H H H H H H H H H H H H
charge: 0
multiplicity: 1
keywords: wb97x-d3
keywords: def2-TZVPP
keywords: def2/J RIJCOSX
keywords: DEFGRID2
keywords: scfconv7
keywords: smallprint printgap noloewdin
keywords: NOSOSCF
formula: C16H14F5N5O5S
InChI: InChI=1/C16H14F5N5O5S/c1-29-10-6-22-15(30-2)26-13(10)23-14(24-26)25-32(27,28)12-8(16(19,20)21)4-3-5-9(12)31-7-11(17)18/h3-6,11,25H,7H2,1-2H3
46 atoms
S  -1.676017 -0.276489 1.110112
F  -5.778852 1.774814 0.240674
F  -4.662789 0.036578 -0.300001
F  -4.937108 0.573676 1.789804
F  2.02054 3.643828 -0.539729
F  3.402578 2.895819 0.986848
O  0.153876 1.672429 0.248335
O  -0.660254 -0.14212 2.122843
O  -2.87033 -1.039699 1.366023
O  2.328009 -4.85334 -2.078188
O  3.999046 -0.442584 0.55584
N  -0.997179 -0.965155 -0.267784
N  2.335037 -1.673092 -0.317271
N  0.497032 -2.603925 -1.034501
N  1.36457 -0.827324 0.062496
N  4.499378 -2.419806 -0.514565
C  -2.138139 1.378112 0.568404
C  -3.446119 1.884176 0.495703
C  -1.057915 2.23369 0.334132
C  -3.620592 3.245949 0.290625
C  0.293332 -1.441407 -0.383566
C  -1.252421 3.594051 0.133233
C  -4.704539 1.043647 0.571259
C  1.805454 -2.742099 -0.989953
C  -2.535379 4.094129 0.137544
C  2.713319 -3.72659 -1.459769
C  3.667361 -1.53548 -0.094621
C  1.208603 2.121005 1.075062
C  4.033812 -3.49654 -1.192146
C  2.356101 2.546433 0.193406
C  1.374111 -4.733909 -3.122442
C  5.38269 -0.241888 0.820737
H  -1.6673 -1.551031 -0.750752
H  -4.613926 3.662296 0.2364
H  -0.403436 4.236952 -0.05336
H  -2.703158 5.151287 -0.016013
H  0.899378 2.949758 1.721385
H  1.524319 1.285786 1.701283
H  4.776887 -4.213826 -1.517019
H  2.673202 1.761314 -0.493005
H  1.306337 -5.715629 -3.58538
H  1.696497 -4.012091 -3.878266
H  0.392235 -4.44339 -2.749622
H  5.441223 0.710014 1.339279
H  5.783675 -1.036379 1.449519
H  5.961329 -0.199269 -0.101871
totalener: -2165.58846364 hartree
nucrepener: 3821.60456070 hartree
electener: -5987.19302434 hartree
twoeener: 4596.96841910 hartree
kineticenergy: 2158.29391610 hartree
xcener: -174.620325615302 hartree
chargesum: 0.0000000
charge: 0.861617 -0.176022 -0.165736 -0.146687 -0.210532 -0.209185 -0.323082 -0.427655 -0.438651 -0.305299 -0.273361 -0.213706 0.153072 -0.394565 -0.355952 -0.365335 -0.177420 -0.028707 0.222125 -0.098739 0.320695 -0.163868 0.547989 0.232490 -0.102096 0.086953 0.389566 -0.002397 -0.022994 0.330934 -0.120283 -0.115274 0.165314 0.135067 0.141598 0.136996 0.120687 0.127764 0.120902 0.063772 0.115030 0.097990 0.116912 0.122103 0.117872 0.110097
qa: 0.8616 -0.1760 -0.1657 -0.1467 -0.2105 -0.2092 -0.3231 -0.4277 -0.4387 -0.3053 -0.2734 -0.2137 0.1531 -0.3946 -0.3560 -0.3653 -0.1774 -0.0287 0.2221 -0.0987 0.3207 -0.1639 0.5480 0.2325 -0.1021 0.0870 0.3896 -0.0024 -0.0230 0.3309 -0.1203 -0.1153 0.1653 0.1351 0.1416 0.1370 0.1207 0.1278 0.1209 0.0638 0.1150 0.0980 0.1169 0.1221 0.1179 0.1101
va: 5.8483 1.1209 1.1380 1.1586 1.0697 1.0681 2.0153 2.0661 2.0561 2.0757 2.1469 3.0872 3.4147 3.0441 2.8556 3.0773 3.9397 3.7265 3.9212 3.9453 4.2139 4.0018 4.4440 3.8670 3.9534 3.9042 4.1345 3.7491 4.0758 4.1190 3.8497 3.8524 1.0408 1.0169 1.0258 1.0002 1.0087 1.0253 1.0098 1.0037 0.9960 0.9921 0.9985 0.9974 1.0005 0.9993
dispcorr: -0.026607054 hartree
energy: -2165.615070698197
dipole: 29.43566 -28.08036 1.35530 -9.95749 10.82530 0.86781 -9.11231 7.89582 -1.21649
magnitude: 2.01737 au
magnitude: 5.12775 debye
