program: Orca
programVersion: 5.0.2
elementType: S O O O O O O N N N N N C C C C C C C C C C C C C C H H H H H H H H H H H H H H H
charge: 0
multiplicity: 1
keywords: wb97x-d3
keywords: def2-TZVPP
keywords: def2/J RIJCOSX
keywords: DEFGRID2
keywords: scfconv7
keywords: smallprint printgap noloewdin
keywords: NOSOSCF
formula: C14H15N5O6S
InChI: InChI=1/C14H15N5O6S/c1-8-15-12(18-14(16-8)25-3)17-13(21)19-26(22,23)10-7-5-4-6-9(10)11(20)24-2/h4-7,17,19H,1-3H3
41 atoms
S  1.765642 0.518602 1.511165
O  1.845601 -0.837507 2.02575
O  2.048225 1.632954 2.392554
O  1.083506 -1.647647 -0.726269
O  2.976581 -2.818818 -0.497837
O  0.424372 2.746533 0.10492
O  -5.747415 0.135365 -0.95721
N  0.206124 0.651065 0.954014
N  -1.567662 1.714951 -0.107603
N  -2.182667 -0.402253 0.631706
N  -3.671017 0.975576 -0.556261
N  -4.346733 -1.167616 0.167134
C  2.829024 0.64982 0.098947
C  3.08316 -0.45628 -0.715649
C  3.519896 1.83912 -0.076201
C  4.049132 -0.344317 -1.705506
C  4.461166 1.940998 -1.089197
C  4.72718 0.850431 -1.899211
C  2.386836 -1.772965 -0.606854
C  -0.255205 1.764106 0.313804
C  -2.498049 0.717755 -0.000409
C  -3.143224 -1.324392 0.688284
C  -4.549177 -0.003117 -0.441114
C  0.289456 -2.837034 -0.647099
C  -2.834577 -2.606648 1.371369
C  -6.071872 1.343064 -1.648726
H  3.348001 2.682983 0.575842
H  -0.429376 -0.158043 1.049156
H  4.265398 -1.192915 -2.340948
H  4.99384 2.87132 -1.227894
H  5.469589 0.922001 -2.682141
H  -3.609757 -2.846306 2.098607
H  -1.870903 -2.570405 1.871792
H  -2.81798 -3.418287 0.641929
H  -0.736288 -2.519476 -0.801489
H  0.566487 -3.545307 -1.426989
H  -5.431267 1.488056 -2.517601
H  -7.100532 1.223807 -1.97592
H  -6.000079 2.209871 -0.993191
H  0.386252 -3.309213 0.329797
H  -1.877985 2.550053 -0.590237
elementType: S O N C H
totalener: -1666.03919674 hartree
nucrepener: 2669.12543481 hartree
electener: -4335.16463155 hartree
oneelecener: -7588.24031052 hartree
twoeener: 3253.07567897 hartree
cpcmener: -0.05900673 hartree
kineticenergy: 1660.08942859 hartree
xcener: -135.886278119038 hartree
chargesum: -0.0000000
charge: 0.893757 -0.523054 -0.508610 -0.265152 -0.458290 -0.486156 -0.280228 -0.194770 -0.135120 -0.417090 -0.419818 -0.385453 -0.152217 0.079180 -0.001103 -0.202886 -0.169652 -0.101731 0.475836 0.396619 0.413398 0.340123 0.463679 -0.130641 -0.272021 -0.116220 0.148234 0.225482 0.153208 0.167754 0.167710 0.124320 0.102372 0.117025 0.122228 0.134348 0.119164 0.132506 0.117991 0.127843 0.197437
qa: 0.8938 -0.5231 -0.5086 -0.2652 -0.4583 -0.4862 -0.2802 -0.1948 -0.1351 -0.4171 -0.4198 -0.3855 -0.1522 0.0792 -0.0011 -0.2029 -0.1697 -0.1017 0.4758 0.3966 0.4134 0.3401 0.4637 -0.1306 -0.2720 -0.1162 0.1482 0.2255 0.1532 0.1678 0.1677 0.1243 0.1024 0.1170 0.1222 0.1343 0.1192 0.1325 0.1180 0.1278 0.1974
va: 5.7967 1.9612 1.9924 2.1223 2.0419 2.0278 2.1255 3.0911 3.2145 2.9945 2.9579 3.0008 3.8300 3.6955 3.8402 4.0238 3.9603 3.9010 4.0766 4.3874 4.1978 3.8819 4.2462 3.8444 3.9548 3.8457 1.0222 1.0490 1.0070 0.9875 0.9859 1.0092 1.0074 0.9973 0.9948 0.9968 0.9945 0.9945 0.9947 0.9906 1.0133
dispcorr: -0.022682899 hartree
energy: -1666.061879638250
dipole: -10.16867 7.93901 -2.22966 -6.03502 6.37772 0.34270 -8.12061 5.20942 -2.91120
magnitude: 3.68292 au
magnitude: 9.36124 debye
