program: Orca
programVersion: 5.0.2
elementType: S O O O O O O N N N N N C C C C C C C C C C C C C C H H H H H H H H H H H H H H H
charge: 0
multiplicity: 1
keywords: wb97x-d3
keywords: def2-TZVPP
keywords: def2/J RIJCOSX
keywords: DEFGRID2
keywords: scfconv7
keywords: smallprint printgap noloewdin
keywords: NOSOSCF
formula: C14H15N5O6S
InChI: InChI=1/C14H15N5O6S/c1-8-15-12(18-14(16-8)25-3)17-13(21)19-26(22,23)10-7-5-4-6-9(10)11(20)24-2/h4-7,17,19H,1-3H3
41 atoms
S  1.444891 1.789286 -0.630686
O  1.775808 3.119637 -0.167219
O  1.227823 1.557483 -2.046453
O  2.465987 -1.520743 -2.736819
O  0.690622 -1.323207 -1.391624
O  0.653111 1.793538 2.222141
O  -5.358023 -1.334874 1.956508
N  0.027507 1.299685 0.090935
N  -1.346429 0.807219 1.901343
N  -2.237026 -0.042772 -0.070856
N  -3.356526 -0.252196 1.985624
N  -4.289938 -1.167017 0.018883
C  2.68777 0.664874 -0.055074
C  2.830703 -0.598109 -0.634424
C  3.574801 1.116237 0.909359
C  3.882754 -1.402497 -0.219975
C  4.607578 0.289712 1.325993
C  4.76032 -0.965048 0.762428
C  1.863497 -1.164773 -1.623343
C  -0.155868 1.333028 1.444909
C  -2.343166 0.150756 1.231766
C  -3.238089 -0.720349 -0.638178
C  -4.297115 -0.89516 1.323214
C  1.666722 -2.148767 -3.74744
C  -3.142267 -0.958615 -2.100053
C  -5.475261 -1.10694 3.361735
H  3.479981 2.105785 1.331976
H  -0.66227 0.779127 -0.474056
H  4.012933 -2.384422 -0.65488
H  5.296116 0.638034 2.083105
H  5.568636 -1.609402 1.079873
H  -3.878779 -1.682635 -2.435868
H  -2.143239 -1.302609 -2.365777
H  -3.310599 -0.020734 -2.633166
H  1.231443 -3.07842 -3.383255
H  0.877135 -1.48228 -4.092261
H  -5.497431 -0.042712 3.592325
H  -6.419974 -1.557046 3.651948
H  -4.664909 -1.583216 3.91176
H  2.344028 -2.362649 -4.568134
H  -1.4767 0.889679 2.902477
elementType: S O N C H
totalener: -1666.03993018 hartree
nucrepener: 2649.07634173 hartree
electener: -4315.11627191 hartree
oneelecener: -7549.88714918 hartree
twoeener: 3234.77087726 hartree
cpcmener: -0.05438627 hartree
kineticenergy: 1660.08402509 hartree
xcener: -135.884377095411 hartree
chargesum: -0.0000000
charge: 0.895150 -0.504591 -0.520179 -0.269320 -0.461381 -0.484890 -0.278634 -0.205336 -0.136427 -0.421097 -0.420515 -0.376417 -0.133286 0.069547 -0.011193 -0.195664 -0.167503 -0.102811 0.480485 0.396227 0.406099 0.330518 0.475002 -0.126477 -0.244937 -0.115609 0.150275 0.222428 0.152957 0.167182 0.167904 0.100153 0.099902 0.116480 0.122744 0.121712 0.118650 0.132493 0.118440 0.134456 0.197464
qa: 0.8951 -0.5046 -0.5202 -0.2693 -0.4614 -0.4849 -0.2786 -0.2053 -0.1364 -0.4211 -0.4205 -0.3764 -0.1333 0.0695 -0.0112 -0.1957 -0.1675 -0.1028 0.4805 0.3962 0.4061 0.3305 0.4750 -0.1265 -0.2449 -0.1156 0.1503 0.2224 0.1530 0.1672 0.1679 0.1002 0.0999 0.1165 0.1227 0.1217 0.1187 0.1325 0.1184 0.1345 0.1975
va: 5.8035 1.9941 1.9668 2.1465 2.0344 2.0257 2.1267 3.0857 3.2127 3.0027 2.9566 3.0147 3.7734 3.7016 3.8456 4.0247 3.9584 3.8957 4.0522 4.3871 4.2115 3.9248 4.2248 3.8504 3.9349 3.8452 1.0207 1.0620 1.0069 0.9875 0.9857 1.0185 1.0106 0.9995 0.9929 0.9917 0.9946 0.9944 0.9947 0.9940 1.0132
dispcorr: -0.021149617 hartree
energy: -1666.061079800743
dipole: -4.78450 4.86416 0.07966 -12.41810 9.53470 -2.88340 -2.44605 3.24037 0.79432
magnitude: 2.99187 au
magnitude: 7.60473 debye
