program: Orca
programVersion: 5.0.2
elementType: S O O O O O O N N N N N C C C C C C C C C C C C C C H H H H H H H H H H H H H H H
charge: 0
multiplicity: 1
keywords: wb97x-d3
keywords: def2-TZVPP
keywords: def2/J RIJCOSX
keywords: DEFGRID2
keywords: scfconv7
keywords: smallprint printgap noloewdin
keywords: NOSOSCF
formula: C14H15N5O6S
InChI: InChI=1/C14H15N5O6S/c1-8-15-12(18-14(16-8)25-3)17-13(21)19-26(22,23)10-7-5-4-6-9(10)11(20)24-2/h4-7,17,19H,1-3H3
41 atoms
S  1.828021 0.610227 1.595721
O  1.863995 -0.759407 2.075838
O  2.301706 1.677324 2.450367
O  2.535956 -2.697268 -0.442422
O  0.611197 -1.576669 -0.643246
O  0.483889 2.991744 0.4561
O  -5.45083 0.417935 -1.3186
N  0.227519 0.86558 1.221965
N  -1.507049 1.979149 0.14667
N  -2.10358 -0.209389 0.660791
N  -3.511731 1.196711 -0.59165
N  -4.14303 -1.032542 -0.135754
C  2.687487 0.688714 0.049273
C  2.669824 -0.401255 -0.822919
C  3.437796 1.820002 -0.229884
C  3.420555 -0.332865 -1.987439
C  4.167579 1.878469 -1.407811
C  4.158421 0.805498 -2.28244
C  1.816048 -1.610172 -0.60773
C  -0.207057 2.006219 0.605608
C  -2.401383 0.942798 0.075884
C  -3.00077 -1.17995 0.515517
C  -4.345709 0.170803 -0.656671
C  1.825926 -3.932317 -0.275093
C  -2.686272 -2.492291 1.133493
C  -6.417563 -0.622537 -1.478003
H  3.470422 2.650368 0.460349
H  -0.41338 0.054606 1.228271
H  3.42206 -1.167385 -2.676112
H  4.747975 2.762486 -1.63185
H  4.730641 0.846783 -3.199058
H  -3.402587 -3.254145 0.840668
H  -2.701029 -2.398672 2.220835
H  -1.682006 -2.810964 0.85402
H  1.257614 -4.1810 -1.170231
H  2.585591 -4.689105 -0.105891
H  -6.808461 -0.955046 -0.517642
H  -7.221911 -0.183972 -2.061246
H  -6.003064 -1.472286 -2.018339
H  1.158866 -3.887437 0.584737
H  -1.79978 2.835966 -0.307534
elementType: S O N C H
totalener: -1666.03864097 hartree
nucrepener: 2666.68180174 hartree
electener: -4332.72044271 hartree
oneelecener: -7585.17079710 hartree
twoeener: 3252.45035439 hartree
cpcmener: -0.05321705 hartree
kineticenergy: 1660.08455486 hartree
xcener: -135.884078933460 hartree
chargesum: 0.0000000
charge: 0.892316 -0.520592 -0.503610 -0.268652 -0.455240 -0.482561 -0.281383 -0.208473 -0.134814 -0.415249 -0.386710 -0.402417 -0.122568 0.069474 -0.019307 -0.192559 -0.165094 -0.104867 0.468827 0.393253 0.407849 0.312628 0.479385 -0.129658 -0.232937 -0.114353 0.149863 0.220331 0.153942 0.168053 0.167682 0.099569 0.115691 0.097618 0.124717 0.135698 0.118138 0.132027 0.118118 0.120502 0.195365
qa: 0.8923 -0.5206 -0.5036 -0.2687 -0.4552 -0.4826 -0.2814 -0.2085 -0.1348 -0.4152 -0.3867 -0.4024 -0.1226 0.0695 -0.0193 -0.1926 -0.1651 -0.1049 0.4688 0.3933 0.4078 0.3126 0.4794 -0.1297 -0.2329 -0.1144 0.1499 0.2203 0.1539 0.1681 0.1677 0.0996 0.1157 0.0976 0.1247 0.1357 0.1181 0.1320 0.1181 0.1205 0.1954
va: 5.8040 1.9658 1.9947 2.1444 2.0378 2.0286 2.1256 3.0751 3.2098 2.9997 2.9759 2.9947 3.7672 3.7185 3.8524 4.0221 3.9542 3.8942 4.0601 4.3903 4.1980 3.9625 4.2114 3.8553 3.9205 3.8409 1.0205 1.0673 1.0040 0.9870 0.9856 1.0190 1.0008 1.0091 0.9921 0.9938 0.9957 0.9942 0.9958 0.9898 1.0155
dispcorr: -0.021803980 hartree
energy: -1666.060444951429
dipole: -7.99323 6.88820 -1.10503 -15.48502 13.02900 -2.45601 -7.57779 4.98315 -2.59464
magnitude: 3.73968 au
magnitude: 9.50552 debye
