program: Orca
programVersion: 5.0.2
elementType: S O O O O O O N N N N N C C C C C C C C C C C C C C H H H H H H H H H H H H H H H
charge: 0
multiplicity: 1
keywords: wb97x-d3
keywords: def2-TZVPP
keywords: def2/J RIJCOSX
keywords: DEFGRID2
keywords: scfconv7
keywords: smallprint printgap noloewdin
keywords: NOSOSCF
formula: C14H15N5O6S
InChI: InChI=1/C14H15N5O6S/c1-8-15-12(18-14(16-8)25-3)17-13(21)19-26(22,23)10-7-5-4-6-9(10)11(20)24-2/h4-7,17,19H,1-3H3
41 atoms
S  1.513293 0.11597 -1.633761
O  1.875389 0.876802 -2.810655
O  1.439355 -1.333397 -1.705074
O  2.388871 -2.512125 1.205098
O  0.566707 -1.216681 1.284524
O  0.459086 2.77803 -0.919655
O  -3.359691 -2.176416 -0.201936
N  -0.009041 0.567834 -1.135994
N  -1.567565 2.053686 -0.249102
N  -3.619105 1.67515 0.664768
N  -2.406396 -0.111725 -0.262565
N  -4.517665 -0.500374 0.694475
C  2.604511 0.559776 -0.311318
C  2.681429 -0.23094 0.836418
C  3.44195 1.649928 -0.488293
C  3.612376 0.098135 1.810666
C  4.353458 1.976106 0.504287
C  4.436021 1.203813 1.650339
C  1.751015 -1.366688 1.113439
C  -0.313533 1.852595 -0.78544
C  -2.562774 1.164705 0.057299
C  -4.57177 0.795839 0.96765
C  -3.414595 -0.896496 0.076322
C  1.609861 -3.671711 1.529969
C  -5.788162 1.322005 1.637408
C  -2.201578 -2.695956 -0.861988
H  3.399806 2.243212 -1.389994
H  -0.69279 -0.173922 -0.932209
H  3.687347 -0.502499 2.70738
H  5.001326 2.83114 0.371766
H  5.148558 1.454337 2.424057
H  -6.379197 0.52409 2.077768
H  -6.408789 1.841176 0.903803
H  -5.524443 2.047875 2.404484
H  1.141415 -3.568719 2.507901
H  0.84725 -3.85585 0.774051
H  -1.314114 -2.59309 -0.238855
H  -2.406732 -3.750375 -1.022019
H  -2.03684 -2.210564 -1.82315
H  2.309118 -4.501866 1.54943
H  -1.75471 3.015494 0.008372
elementType: S O N C H
totalener: -1666.03916396 hartree
nucrepener: 2695.85041841 hartree
electener: -4361.88958236 hartree
oneelecener: -7642.81000149 hartree
twoeener: 3280.92041912 hartree
cpcmener: -0.05268673 hartree
kineticenergy: 1660.07784109 hartree
xcener: -135.882884705989 hartree
chargesum: -0.0000000
charge: 0.892521 -0.503336 -0.520669 -0.268512 -0.455375 -0.482711 -0.279270 -0.204784 -0.133184 -0.415196 -0.426810 -0.375306 -0.126737 0.077137 -0.015681 -0.194795 -0.165211 -0.104858 0.466560 0.389721 0.400488 0.333358 0.457977 -0.129311 -0.238773 -0.106508 0.150471 0.236781 0.154536 0.167960 0.167791 0.097246 0.115175 0.104295 0.123933 0.121827 0.097738 0.138658 0.121516 0.135787 0.195553
qa: 0.8925 -0.5033 -0.5207 -0.2685 -0.4554 -0.4827 -0.2793 -0.2048 -0.1332 -0.4152 -0.4268 -0.3753 -0.1267 0.0771 -0.0157 -0.1948 -0.1652 -0.1049 0.4666 0.3897 0.4005 0.3334 0.4580 -0.1293 -0.2388 -0.1065 0.1505 0.2368 0.1545 0.1680 0.1678 0.0972 0.1152 0.1043 0.1239 0.1218 0.0977 0.1387 0.1215 0.1358 0.1956
va: 5.7961 1.9953 1.9632 2.1442 2.0342 2.0306 2.1366 3.0960 3.2090 3.0122 2.9449 3.0065 3.7757 3.7081 3.8448 4.0265 3.9521 3.8964 4.0581 4.3942 4.2326 3.9547 4.2340 3.8599 3.9326 3.8440 1.0194 1.0308 1.0043 0.9870 0.9856 1.0162 0.9998 1.0078 0.9923 0.9863 1.0009 0.9966 0.9939 0.9941 1.0163
dispcorr: -0.022733868 hartree
energy: -1666.061897823735
dipole: -4.56334 4.87198 0.30864 -7.23186 6.56817 -0.66369 9.81172 -7.31323 2.49850
magnitude: 2.60350 au
magnitude: 6.61758 debye
