program: Orca
programVersion: 5.0.2
elementType: S O O O O O O N N N N N C C C C C C C C C C C C C C H H H H H H H H H H H H H H H
charge: 0
multiplicity: 1
keywords: wb97x-d3
keywords: def2-TZVPP
keywords: def2/J RIJCOSX
keywords: DEFGRID2
keywords: scfconv7
keywords: smallprint printgap noloewdin
keywords: NOSOSCF
formula: C14H15N5O6S
InChI: InChI=1/C14H15N5O6S/c1-8-15-12(18-14(16-8)25-3)17-13(21)19-26(22,23)10-7-5-4-6-9(10)11(20)24-2/h4-7,17,19H,1-3H3
41 atoms
S  1.832479 0.469944 1.642268
O  1.875576 -0.919894 2.060477
O  2.30824 1.499563 2.540712
O  2.454695 -2.724076 -0.51363
O  0.550139 -1.571576 -0.732192
O  0.489077 2.868183 0.547655
O  -5.446398 0.186262 -1.321348
N  0.228072 0.735213 1.289025
N  -1.494265 1.854939 0.197982
N  -2.104574 -0.332299 0.697032
N  -3.486146 1.075764 -0.58005
N  -4.129907 -1.154161 -0.143404
C  2.67912 0.618409 0.0945
C  2.62768 -0.421805 -0.834468
C  3.444996 1.750204 -0.13564
C  3.360316 -0.304472 -2.006086
C  4.158001 1.858633 -1.319996
C  4.114179 0.835146 -2.251492
C  1.753239 -1.62423 -0.668964
C  -0.201213 1.879877 0.676803
C  -2.384434 0.81752 0.110785
C  -3.005265 -1.303751 0.526691
C  -4.318631 0.057277 -0.665329
C  1.724087 -3.951379 -0.380273
C  -2.699345 -2.61773 1.145128
C  -5.756365 1.43604 -1.939822
H  3.499877 2.542481 0.597076
H  -0.412396 -0.076143 1.281373
H  3.334308 -1.101079 -2.738154
H  4.750983 2.743218 -1.505752
H  4.672191 0.915861 -3.174246
H  -3.425539 -3.372642 0.858959
H  -2.7015 -2.523566 2.23238
H  -1.701077 -2.946738 0.855032
H  1.134812 -4.158277 -1.273233
H  2.472203 -4.727277 -0.251019
H  -5.817765 2.239566 -1.207225
H  -5.024701 1.693054 -2.704443
H  -6.728506 1.297842 -2.403917
H  1.072096 -3.925112 0.493083
H  -1.78275 2.713299 -0.256051
elementType: S O N C H
totalener: -1666.03844505 hartree
nucrepener: 2676.45236329 hartree
electener: -4342.49080834 hartree
oneelecener: -7604.51064576 hartree
twoeener: 3262.01983741 hartree
cpcmener: -0.05381494 hartree
kineticenergy: 1660.08744335 hartree
xcener: -135.883820090346 hartree
chargesum: -0.0000000
charge: 0.891675 -0.519067 -0.503588 -0.267636 -0.451915 -0.480402 -0.277848 -0.209334 -0.136376 -0.418162 -0.417323 -0.373007 -0.121412 0.071829 -0.024481 -0.190019 -0.162894 -0.106609 0.463475 0.390474 0.398675 0.328171 0.475899 -0.131661 -0.233485 -0.115752 0.151144 0.220556 0.153839 0.168212 0.167747 0.098646 0.114378 0.096889 0.123707 0.136445 0.118461 0.119241 0.132288 0.121959 0.197264
qa: 0.8917 -0.5191 -0.5036 -0.2676 -0.4519 -0.4804 -0.2778 -0.2093 -0.1364 -0.4182 -0.4173 -0.3730 -0.1214 0.0718 -0.0245 -0.1900 -0.1629 -0.1066 0.4635 0.3905 0.3987 0.3282 0.4759 -0.1317 -0.2335 -0.1158 0.1511 0.2206 0.1538 0.1682 0.1677 0.0986 0.1144 0.0969 0.1237 0.1364 0.1185 0.1192 0.1323 0.1220 0.1973
va: 5.8031 1.9670 1.9948 2.1434 2.0393 2.0312 2.1273 3.0750 3.2100 2.9985 2.9576 3.0168 3.7698 3.7172 3.8537 4.0202 3.9509 3.8931 4.0631 4.3922 4.2191 3.9307 4.2206 3.8557 3.9327 3.8448 1.0192 1.0670 1.0032 0.9868 0.9856 1.0199 1.0011 1.0075 0.9925 0.9939 0.9944 0.9944 0.9945 0.9888 1.0132
dispcorr: -0.022043842 hartree
energy: -1666.060488895792
dipole: -6.32157 5.66083 -0.66074 -8.70207 7.99477 -0.70731 -9.12208 6.18692 -2.93516
magnitude: 3.09063 au
magnitude: 7.85576 debye
