program: Orca
programVersion: 5.0.2
elementType: S O O O O O O N N N N N C C C C C C C C C C C C C C H H H H H H H H H H H H H H H
charge: 0
multiplicity: 1
keywords: wb97x-d3
keywords: def2-TZVPP
keywords: def2/J RIJCOSX
keywords: DEFGRID2
keywords: scfconv7
keywords: smallprint printgap noloewdin
keywords: NOSOSCF
formula: C14H15N5O6S
InChI: InChI=1/C14H15N5O6S/c1-8-15-12(18-14(16-8)25-3)17-13(21)19-26(22,23)10-7-5-4-6-9(10)11(20)24-2/h4-7,17,19H,1-3H3
41 atoms
S  1.449424 1.910565 -0.696664
O  1.858963 3.234738 -0.281417
O  1.215063 1.638152 -2.103483
O  2.141409 -1.542147 -2.6289
O  0.47481 -1.217572 -1.173862
O  0.709549 1.898524 2.166087
O  -4.958153 -1.792704 1.949951
N  0.004282 1.529151 0.036292
N  -1.279633 0.881876 1.865055
N  -2.265949 0.196685 -0.125627
N  -3.123834 -0.446124 1.965445
N  -4.124118 -1.225554 -0.026671
C  2.633448 0.744312 -0.081914
C  2.68212 -0.556044 -0.588229
C  3.578144 1.197957 0.824638
C  3.702537 -1.395301 -0.164873
C  4.577816 0.338298 1.253647
C  4.640433 -0.952519 0.757971
C  1.63413 -1.120238 -1.491837
C  -0.124198 1.470594 1.395854
C  -2.253147 0.190267 1.194773
C  -3.214184 -0.548946 -0.698731
C  -4.035531 -1.125783 1.299319
C  1.240073 -2.15468 -3.560967
C  -3.2211 -0.595504 -2.182505
C  -4.954012 -1.775674 3.378364
H  3.552669 2.213174 1.192575
H  -0.720197 1.058538 -0.529887
H  3.759853 -2.406493 -0.544883
H  5.31154 0.688342 1.966211
H  5.424684 -1.621883 1.083692
H  -3.449175 0.393284 -2.583864
H  -3.954732 -1.303097 -2.55705
H  -2.23228 -0.869016 -2.552282
H  1.833451 -2.375079 -4.443347
H  0.829285 -3.07985 -3.157247
H  -5.09691 -0.76755 3.764928
H  -5.791332 -2.39853 3.679013
H  -4.031544 -2.193666 3.778815
H  0.429152 -1.476914 -3.827053
H  -1.341434 0.845955 2.875613
elementType: S O N C H
totalener: -1666.03880873 hartree
nucrepener: 2672.53404854 hartree
electener: -4338.57285727 hartree
oneelecener: -7596.73907314 hartree
twoeener: 3258.16621588 hartree
cpcmener: -0.05381210 hartree
kineticenergy: 1660.08906018 hartree
xcener: -135.884390005043 hartree
chargesum: -0.0000000
charge: 0.896996 -0.506009 -0.520995 -0.270077 -0.456593 -0.482063 -0.278222 -0.207757 -0.138368 -0.420545 -0.416741 -0.373465 -0.131072 0.071669 -0.014048 -0.195189 -0.164900 -0.103717 0.474374 0.391614 0.399128 0.329119 0.475768 -0.127845 -0.234628 -0.115655 0.151062 0.220800 0.153863 0.167230 0.167950 0.114569 0.099065 0.097759 0.135563 0.124213 0.118926 0.132616 0.118555 0.119950 0.197098
qa: 0.8970 -0.5060 -0.5210 -0.2701 -0.4566 -0.4821 -0.2782 -0.2078 -0.1384 -0.4205 -0.4167 -0.3735 -0.1311 0.0717 -0.0140 -0.1952 -0.1649 -0.1037 0.4744 0.3916 0.3991 0.3291 0.4758 -0.1278 -0.2346 -0.1157 0.1511 0.2208 0.1539 0.1672 0.1680 0.1146 0.0991 0.0978 0.1356 0.1242 0.1189 0.1326 0.1186 0.1200 0.1971
va: 5.8000 1.9914 1.9655 2.1463 2.0376 2.0292 2.1270 3.0779 3.2106 2.9973 2.9567 3.0174 3.7743 3.7037 3.8457 4.0253 3.9543 3.8950 4.0555 4.3927 4.2194 3.9304 4.2211 3.8552 3.9315 3.8443 1.0202 1.0660 1.0057 0.9872 0.9855 1.0012 1.0196 1.0079 0.9940 0.9921 0.9945 0.9943 0.9947 0.9896 1.0134
dispcorr: -0.021820712 hartree
energy: -1666.060629440249
dipole: -5.05511 5.03273 -0.02238 -13.26797 10.18703 -3.08094 -2.12819 2.94905 0.82086
magnitude: 3.18850 au
magnitude: 8.10452 debye
