program: Orca
programVersion: 5.0.2
elementType: S O O O O O O N N N N N C C C C C C C C C C C C C C H H H H H H H H H H H H H H H
charge: 0
multiplicity: 1
keywords: wb97x-d3
keywords: def2-TZVPP
keywords: def2/J RIJCOSX
keywords: DEFGRID2
keywords: scfconv7
keywords: smallprint printgap noloewdin
keywords: NOSOSCF
formula: C14H15N5O6S
InChI: InChI=1/C14H15N5O6S/c1-8-15-12(18-14(16-8)25-3)17-13(21)19-26(22,23)10-7-5-4-6-9(10)11(20)24-2/h4-7,17,19H,1-3H3
41 atoms
S  1.390358 1.915687 -0.649029
O  1.772854 3.232161 -0.185308
O  1.129721 1.701293 -2.060427
O  2.236055 -1.4641 -2.76203
O  0.520372 -1.164045 -1.360933
O  0.693995 1.84109 2.231629
O  -5.030791 -1.779929 2.045327
N  -0.02134 1.460493 0.105425
N  -1.283879 0.799931 1.944034
N  -2.274341 0.106178 -0.04046
N  -3.164935 -0.476346 2.054385
N  -4.179979 -1.249919 0.066605
C  2.620996 0.756696 -0.115648
C  2.712066 -0.512451 -0.69297
C  3.55789 1.192601 0.8076
C  3.763647 -1.336922 -0.318158
C  4.589918 0.34669 1.185197
C  4.691996 -0.913498 0.62293
C  1.690394 -1.062275 -1.634903
C  -0.138264 1.402801 1.466477
C  -2.27233 0.124334 1.28006
C  -3.247401 -0.609574 -0.609323
C  -4.090895 -1.140677 1.39194
C  1.369294 -2.066488 -3.732422
C  -3.257151 -0.662462 -2.09271
C  -5.027807 -1.75688 3.473668
H  3.503005 2.185493 1.229045
H  -0.741217 0.973418 -0.453315
H  3.855386 -2.323123 -0.752816
H  5.316526 0.684196 1.910936
H  5.500382 -1.572553 0.90812
H  -2.272484 -0.944581 -2.465737
H  -3.478555 0.327839 -2.494329
H  -3.999315 -1.36304 -2.463709
H  0.577131 -1.380622 -4.030774
H  1.996889 -2.289944 -4.589453
H  -5.148294 -0.744319 3.856208
H  -5.879304 -2.359294 3.775879
H  -4.11546 -2.194129 3.876598
H  0.933964 -2.988494 -3.34932
H  -1.3451 0.7766 2.954928
elementType: S O N C H
totalener: -1666.03935075 hartree
nucrepener: 2661.46847107 hartree
electener: -4327.50782182 hartree
oneelecener: -7574.64778635 hartree
twoeener: 3247.13996453 hartree
cpcmener: -0.05408485 hartree
kineticenergy: 1660.08721371 hartree
xcener: -135.884715342867 hartree
chargesum: 0.0000000
charge: 0.897491 -0.506299 -0.521122 -0.270202 -0.460430 -0.482308 -0.278006 -0.207452 -0.137596 -0.420528 -0.418090 -0.374050 -0.136232 0.069345 -0.010097 -0.195309 -0.166092 -0.103211 0.482311 0.393486 0.401405 0.329048 0.475911 -0.126381 -0.239509 -0.115721 0.150316 0.221351 0.152925 0.167076 0.167912 0.099739 0.115099 0.099310 0.120230 0.134911 0.118871 0.132622 0.118618 0.123687 0.196972
qa: 0.8975 -0.5063 -0.5211 -0.2702 -0.4604 -0.4823 -0.2780 -0.2075 -0.1376 -0.4205 -0.4181 -0.3741 -0.1362 0.0693 -0.0101 -0.1953 -0.1661 -0.1032 0.4823 0.3935 0.4014 0.3290 0.4759 -0.1264 -0.2395 -0.1157 0.1503 0.2214 0.1529 0.1671 0.1679 0.0997 0.1151 0.0993 0.1202 0.1349 0.1189 0.1326 0.1186 0.1237 0.1970
va: 5.8010 1.9912 1.9664 2.1472 2.0353 2.0289 2.1270 3.0786 3.2118 3.0004 2.9574 3.0170 3.7782 3.7010 3.8448 4.0257 3.9577 3.8966 4.0507 4.3907 4.2177 3.9291 4.2215 3.8519 3.9322 3.8444 1.0209 1.0656 1.0074 0.9875 0.9857 1.0093 1.0005 1.0192 0.9914 0.9940 0.9944 0.9943 0.9947 0.9926 1.0135
dispcorr: -0.021449061 hartree
energy: -1666.060799807011
dipole: -4.71553 4.81424 0.09871 -13.15535 10.04712 -3.10823 -2.46280 3.22831 0.76551
magnitude: 3.20264 au
magnitude: 8.14045 debye
