program: Orca
programVersion: 5.0.2
elementType: S O O O O O O N N N N N C C C C C C C C C C C C C C H H H H H H H H H H H H H H H
charge: 0
multiplicity: 1
keywords: wb97x-d3
keywords: def2-TZVPP
keywords: def2/J RIJCOSX
keywords: DEFGRID2
keywords: scfconv7
keywords: smallprint printgap noloewdin
keywords: NOSOSCF
formula: C14H15N5O6S
InChI: InChI=1/C14H15N5O6S/c1-8-15-12(18-14(16-8)25-3)17-13(21)19-26(22,23)10-7-5-4-6-9(10)11(20)24-2/h4-7,17,19H,1-3H3
41 atoms
S  1.66867 0.346745 1.614301
O  1.578614 -1.080591 1.873705
O  2.206075 1.227606 2.628589
O  1.954822 -2.569364 -1.067183
O  0.216872 -1.161992 -1.034915
O  0.583679 2.893462 0.579743
O  -3.200402 -2.112389 0.878338
N  0.099127 0.786948 1.270446
N  -1.457988 2.063779 0.09879
N  -3.419257 1.426361 -0.877522
N  -2.304606 -0.042872 0.577922
N  -4.290326 -0.723653 -0.476217
C  2.571967 0.594394 0.108655
C  2.430403 -0.293861 -0.958533
C  3.487235 1.633802 0.05974
C  3.226077 -0.116485 -2.081375
C  4.262194 1.806249 -1.076804
C  4.130498 0.934105 -2.143869
C  1.402813 -1.378411 -1.000641
C  -0.199212 1.969953 0.653669
C  -2.42389 1.106107 -0.070109
C  -4.336115 0.473656 -1.042509
C  -3.250328 -0.928028 0.319195
C  1.076855 -3.69668 -1.180062
C  -5.491611 0.7888 -1.920611
C  -2.104424 -2.427746 1.740636
H  3.606857 2.30637 0.896574
H  -0.605356 0.036256 1.235858
H  3.129175 -0.793294 -2.920108
H  4.971101 2.621222 -1.120557
H  4.735333 1.064514 -3.030679
H  -5.158929 1.266324 -2.841047
H  -6.151653 1.495412 -1.413491
H  -6.063396 -0.102894 -2.161393
H  0.476656 -3.640022 -2.087427
H  1.720969 -4.569137 -1.224785
H  -2.284524 -3.44253 2.082884
H  -1.155897 -2.394104 1.205062
H  -2.066897 -1.759687 2.600136
H  0.423427 -3.77145 -0.311026
H  -1.632393 2.937081 -0.384189
elementType: S O N C H
totalener: -1666.03762889 hartree
nucrepener: 2725.41599348 hartree
electener: -4391.45362237 hartree
oneelecener: -7701.90895702 hartree
twoeener: 3310.45533465 hartree
cpcmener: -0.05213529 hartree
kineticenergy: 1660.08484341 hartree
xcener: -135.883000584480 hartree
chargesum: 0.0000000
charge: 0.894991 -0.520125 -0.503546 -0.269173 -0.453086 -0.478128 -0.276744 -0.210287 -0.135121 -0.411830 -0.422489 -0.373234 -0.135577 0.085043 -0.021995 -0.190917 -0.161435 -0.107683 0.469428 0.381334 0.390600 0.334254 0.462162 -0.129285 -0.238394 -0.106239 0.152103 0.234906 0.153947 0.168121 0.167801 0.105667 0.114011 0.096467 0.122851 0.135284 0.139088 0.088272 0.129316 0.123325 0.196317
qa: 0.8950 -0.5201 -0.5035 -0.2692 -0.4531 -0.4781 -0.2767 -0.2103 -0.1351 -0.4118 -0.4225 -0.3732 -0.1356 0.0850 -0.0220 -0.1909 -0.1614 -0.1077 0.4694 0.3813 0.3906 0.3343 0.4622 -0.1293 -0.2384 -0.1062 0.1521 0.2349 0.1539 0.1681 0.1678 0.1057 0.1140 0.0965 0.1229 0.1353 0.1391 0.0883 0.1293 0.1233 0.1963
va: 5.7932 1.9631 1.9941 2.1437 2.0361 2.0334 2.1339 3.0816 3.2066 3.0121 2.9414 3.0098 3.7805 3.6917 3.8459 4.0213 3.9489 3.8955 4.0492 4.4001 4.2407 3.9514 4.2309 3.8639 3.9316 3.8464 1.0180 1.0405 1.0043 0.9868 0.9858 1.0067 1.0004 1.0173 0.9920 0.9942 0.9963 0.9916 0.9935 0.9825 1.0155
dispcorr: -0.023620722 hartree
energy: -1666.061249610364
dipole: -5.70425 5.63358 -0.07067 -8.69109 7.64628 -1.04481 -9.21049 6.70180 -2.50869
magnitude: 2.71848 au
magnitude: 6.90984 debye
