program: Orca
programVersion: 5.0.2
elementType: S O O O O O O N N N N N C C C C C C C C C C C C C C H H H H H H H H H H H H H H H
charge: 0
multiplicity: 1
keywords: wb97x-d3
keywords: def2-TZVPP
keywords: def2/J RIJCOSX
keywords: DEFGRID2
keywords: scfconv7
keywords: smallprint printgap noloewdin
keywords: NOSOSCF
formula: C14H15N5O6S
InChI: InChI=1/C14H15N5O6S/c1-8-15-12(18-14(16-8)25-3)17-13(21)19-26(22,23)10-7-5-4-6-9(10)11(20)24-2/h4-7,17,19H,1-3H3
41 atoms
S  1.574808 0.030968 -1.70107
O  2.039218 0.706588 -2.894017
O  1.484093 -1.419557 -1.686663
O  2.090087 -2.345709 1.467424
O  0.331068 -0.98062 1.244762
O  0.532741 2.728084 -1.091116
O  -3.275318 -2.213494 -0.326627
N  0.025495 0.531357 -1.352258
N  -1.489632 2.016438 -0.389498
N  -3.442452 1.600197 0.712826
N  -2.354015 -0.137002 -0.433256
N  -4.332633 -0.579075 0.753607
C  2.574017 0.548788 -0.330554
C  2.523826 -0.134121 0.886352
C  3.479364 1.578084 -0.536543
C  3.398361 0.240672 1.896179
C  4.332739 1.952231 0.490274
C  4.289996 1.286629 1.703314
C  1.517126 -1.194429 1.194775
C  -0.251528 1.812176 -0.961024
C  -2.459127 1.118859 -0.025938
C  -4.360466 0.706106 1.076832
C  -3.306401 -0.943791 -0.001552
C  1.235518 -3.43401 1.844374
C  -5.49619 1.20022 1.895779
C  -2.184849 -2.700925 -1.113746
H  3.533605 2.088681 -1.48701
H  -0.67379 -0.197144 -1.150238
H  3.374762 -0.275281 2.846868
H  5.032536 2.760993 0.333128
H  4.957286 1.573054 2.50461
H  -6.155151 1.80947 1.27392
H  -5.139303 1.838183 2.703029
H  -6.076231 0.380898 2.310455
H  0.687184 -3.205616 2.757799
H  0.535626 -3.67601 1.044603
H  -2.128218 -2.196278 -2.077395
H  -1.239066 -2.592678 -0.583541
H  -2.387829 -3.756086 -1.271379
H  1.893957 -4.279612 2.018563
H  -1.649754 2.969816 -0.086333
elementType: S O N C H
totalener: -1666.03814532 hartree
nucrepener: 2717.00814731 hartree
electener: -4383.04629263 hartree
oneelecener: -7685.13794763 hartree
twoeener: 3302.09165500 hartree
cpcmener: -0.05235102 hartree
kineticenergy: 1660.07504304 hartree
xcener: -135.881521916033 hartree
chargesum: -0.0000000
charge: 0.895661 -0.505612 -0.520808 -0.269277 -0.454034 -0.477254 -0.277704 -0.208345 -0.134533 -0.413091 -0.423533 -0.373439 -0.135231 0.081322 -0.018960 -0.192307 -0.162532 -0.106619 0.470808 0.381993 0.393714 0.335194 0.459709 -0.129090 -0.237695 -0.103165 0.151874 0.233944 0.154434 0.168072 0.168009 0.113349 0.105753 0.096421 0.123285 0.123002 0.126164 0.089905 0.138749 0.135584 0.196282
qa: 0.8957 -0.5056 -0.5208 -0.2693 -0.4540 -0.4773 -0.2777 -0.2083 -0.1345 -0.4131 -0.4235 -0.3734 -0.1352 0.0813 -0.0190 -0.1923 -0.1625 -0.1066 0.4708 0.3820 0.3937 0.3352 0.4597 -0.1291 -0.2377 -0.1032 0.1519 0.2339 0.1544 0.1681 0.1680 0.1133 0.1058 0.0964 0.1233 0.1230 0.1262 0.0899 0.1387 0.1356 0.1963
va: 5.7918 1.9913 1.9626 2.1449 2.0348 2.0353 2.1344 3.0830 3.2073 3.0127 2.9424 3.0095 3.7808 3.6983 3.8433 4.0250 3.9491 3.8958 4.0493 4.3996 4.2390 3.9515 4.2328 3.8632 3.9317 3.8455 1.0179 1.0397 1.0047 0.9868 0.9857 1.0005 1.0066 1.0173 0.9919 0.9833 0.9939 0.9943 0.9964 0.9941 1.0156
dispcorr: -0.023335484 hartree
energy: -1666.061480804164
dipole: -5.06461 5.17627 0.11165 -6.75716 6.21765 -0.53950 10.79807 -8.14888 2.64919
magnitude: 2.70587 au
magnitude: 6.87777 debye
