program: Orca
programVersion: 5.0.2
elementType: S O O O O O O N N N N N C C C C C C C C C C C C C C H H H H H H H H H H H H H H H
charge: 0
multiplicity: 1
keywords: wb97x-d3
keywords: def2-TZVPP
keywords: def2/J RIJCOSX
keywords: DEFGRID2
keywords: scfconv7
keywords: smallprint printgap noloewdin
keywords: NOSOSCF
formula: C14H15N5O6S
InChI: InChI=1/C14H15N5O6S/c1-8-15-12(18-14(16-8)25-3)17-13(21)19-26(22,23)10-7-5-4-6-9(10)11(20)24-2/h4-7,17,19H,1-3H3
41 atoms
S  1.658291 0.363304 1.582255
O  1.589263 -1.058658 1.872763
O  2.158157 1.279438 2.584632
O  2.11458 -2.626192 -1.0076
O  0.32963 -1.278796 -1.023101
O  0.550151 2.89409 0.55282
O  -3.249092 -2.119478 0.785268
N  0.08804 0.768624 1.199501
N  -1.49329 2.067527 0.083483
N  -3.513832 1.494618 -0.801258
N  -2.326217 -0.05823 0.503915
N  -4.39002 -0.660523 -0.445566
C  2.586412 0.59723 0.090687
C  2.507697 -0.330993 -0.948566
C  3.456511 1.674008 0.02626
C  3.319782 -0.155237 -2.059512
C  4.245876 1.845604 -1.100408
C  4.176584 0.933608 -2.139417
C  1.522002 -1.453934 -0.974878
C  -0.226098 1.964063 0.615872
C  -2.474007 1.124359 -0.073912
C  -4.450352 0.560881 -0.95718
C  -3.306906 -0.914087 0.274003
C  1.275729 -3.785785 -1.093707
C  -5.625366 0.908995 -1.796131
C  -2.124841 -2.482479 1.590765
H  3.530571 2.376573 0.843405
H  -0.602362 0.007196 1.146664
H  3.271671 -0.862491 -2.877027
H  4.917763 2.690541 -1.156768
H  4.793211 1.063091 -3.018151
H  -5.346956 0.835947 -2.85003
H  -5.944238 1.934008 -1.618101
H  -6.456009 0.231188 -1.62023
H  0.626804 -3.862601 -0.22188
H  0.673611 -3.770907 -2.000873
H  -1.198933 -2.451714 1.017521
H  -2.037875 -1.841257 2.466891
H  -2.312886 -3.503244 1.910346
H  1.950028 -4.635682 -1.119346
H  -1.682895 2.959681 -0.35722
elementType: S O N C H
totalener: -1666.03834147 hartree
nucrepener: 2712.86587643 hartree
electener: -4378.90421790 hartree
oneelecener: -7676.81421982 hartree
twoeener: 3297.91000192 hartree
cpcmener: -0.05240658 hartree
kineticenergy: 1660.08446508 hartree
xcener: -135.883398115228 hartree
chargesum: -0.0000000
charge: 0.895037 -0.519591 -0.503646 -0.269191 -0.454677 -0.480751 -0.277865 -0.208770 -0.133215 -0.413250 -0.424742 -0.375374 -0.134067 0.083572 -0.018131 -0.193873 -0.163302 -0.105862 0.469048 0.385430 0.396881 0.333930 0.458567 -0.129426 -0.239883 -0.105892 0.151136 0.235988 0.154124 0.168254 0.167795 0.115926 0.104091 0.097447 0.123307 0.123273 0.090180 0.127204 0.138794 0.135841 0.195681
qa: 0.8950 -0.5196 -0.5036 -0.2692 -0.4547 -0.4808 -0.2779 -0.2088 -0.1332 -0.4133 -0.4247 -0.3754 -0.1341 0.0836 -0.0181 -0.1939 -0.1633 -0.1059 0.4690 0.3854 0.3969 0.3339 0.4586 -0.1294 -0.2399 -0.1059 0.1511 0.2360 0.1541 0.1683 0.1678 0.1159 0.1041 0.0974 0.1233 0.1233 0.0902 0.1272 0.1388 0.1358 0.1957
va: 5.7955 1.9648 1.9942 2.1450 2.0347 2.0312 2.1351 3.0901 3.2078 3.0131 2.9408 3.0059 3.7793 3.6961 3.8436 4.0242 3.9521 3.8961 4.0541 4.3969 4.2344 3.9530 4.2354 3.8610 3.9333 3.8447 1.0192 1.0354 1.0045 0.9868 0.9857 0.9993 1.0086 1.0157 0.9845 0.9922 0.9951 0.9938 0.9965 0.9942 1.0162
dispcorr: -0.023220134 hartree
energy: -1666.061561602329
dipole: -5.47662 5.51044 0.03382 -8.78641 7.69318 -1.09323 -9.09308 6.55313 -2.53995
magnitude: 2.76543 au
magnitude: 7.02917 debye
