program: Orca
programVersion: 5.0.2
elementType: S O O O O O O N N N N N C C C C C C C C C C C C C C H H H H H H H H H H H H H H H
charge: 0
multiplicity: 1
keywords: wb97x-d3
keywords: def2-TZVPP
keywords: def2/J RIJCOSX
keywords: DEFGRID2
keywords: scfconv7
keywords: smallprint printgap noloewdin
keywords: NOSOSCF
formula: C14H15N5O6S
InChI: InChI=1/C14H15N5O6S/c1-8-15-12(18-14(16-8)25-3)17-13(21)19-26(22,23)10-7-5-4-6-9(10)11(20)24-2/h4-7,17,19H,1-3H3
41 atoms
S  1.448854 1.848347 -0.690695
O  1.824529 3.176865 -0.263545
O  1.223469 1.573242 -2.097229
O  2.290974 -1.491995 -2.697916
O  0.567536 -1.298973 -1.286845
O  0.688282 1.859315 2.170513
O  -5.11427 -1.628789 1.990204
N  0.018607 1.414791 0.043166
N  -1.301932 0.84516 1.871363
N  -2.260726 0.093519 -0.108524
N  -3.218116 -0.375106 1.984347
N  -4.211796 -1.196113 0.007787
C  2.654669 0.702872 -0.078237
C  2.734436 -0.588567 -0.600957
C  3.569258 1.157229 0.858518
C  3.752427 -1.421541 -0.159135
C  4.568325 0.304783 1.302726
C  4.658274 -0.980045 0.795295
C  1.730197 -1.145292 -1.560326
C  -0.132303 1.410919 1.402079
C  -2.289632 0.169318 1.210277
C  -3.245279 -0.611143 -0.670397
C  -4.147994 -1.040623 1.329098
C  1.445725 -2.078389 -3.693616
C  -3.227956 -0.72317 -2.152112
C  -5.12446 -1.547022 3.415409
H  3.51841 2.167285 1.238455
H  -0.698481 0.93562 -0.524053
H  3.83464 -2.426213 -0.552483
H  5.279224 0.654426 2.038789
H  5.440828 -1.644685 1.135811
H  -2.238418 -1.024159 -2.496926
H  -3.439102 0.250052 -2.599417
H  -3.968667 -1.435913 -2.504321
H  1.020559 -3.019845 -3.34717
H  0.644624 -1.397591 -3.979942
H  -5.22615 -0.516746 3.756046
H  -5.991598 -2.118756 3.73452
H  -4.224704 -1.984512 3.847378
H  2.084662 -2.264193 -4.551835
H  -1.392492 0.86372 2.880297
elementType: S O N C H
totalener: -1666.04151148 hartree
nucrepener: 2662.86390976 hartree
electener: -4328.90542124 hartree
oneelecener: -7577.22437276 hartree
twoeener: 3248.31895152 hartree
cpcmener: -0.04460345 hartree
kineticenergy: 1660.10162933 hartree
xcener: -135.884178595967 hartree
chargesum: -0.0000000
charge: 0.886681 -0.490792 -0.509505 -0.265566 -0.434920 -0.456626 -0.269371 -0.207152 -0.141225 -0.417174 -0.419384 -0.367367 -0.133570 0.073434 -0.011804 -0.193535 -0.163290 -0.106512 0.452566 0.378557 0.399354 0.323874 0.467370 -0.128733 -0.240143 -0.116757 0.148787 0.219960 0.150059 0.163392 0.163808 0.098556 0.113756 0.100029 0.120893 0.119867 0.117401 0.131348 0.116709 0.133384 0.193641
qa: 0.8867 -0.4908 -0.5095 -0.2656 -0.4349 -0.4566 -0.2694 -0.2072 -0.1412 -0.4172 -0.4194 -0.3674 -0.1336 0.0734 -0.0118 -0.1935 -0.1633 -0.1065 0.4526 0.3786 0.3994 0.3239 0.4674 -0.1287 -0.2401 -0.1168 0.1488 0.2200 0.1501 0.1634 0.1638 0.0986 0.1138 0.1000 0.1209 0.1199 0.1174 0.1313 0.1167 0.1334 0.1936
va: 5.8192 2.0120 1.9802 2.1438 2.0620 2.0612 2.1362 3.0762 3.2048 3.0011 2.9566 3.0189 3.7884 3.7017 3.8506 4.0261 3.9541 3.8998 4.0859 4.4070 4.2181 3.9333 4.2321 3.8594 3.9307 3.8492 1.0217 1.0644 1.0064 0.9886 0.9871 1.0094 1.0008 1.0189 0.9928 0.9911 0.9947 0.9945 0.9952 0.9942 1.0159
dispcorr: -0.021529108 hartree
energy: -1666.063040591472
dipole: -4.89990 4.88898 -0.01092 -12.74969 9.97536 -2.77433 -2.20421 3.00994 0.80572
magnitude: 2.88898 au
magnitude: 7.34321 debye
