program: Orca
programVersion: 5.0.2
elementType: S O O O O O O N N N N N C C C C C C C C C C C C C C H H H H H H H H H H H H H H H
charge: 0
multiplicity: 1
keywords: wb97x-d3
keywords: def2-TZVPP
keywords: def2/J RIJCOSX
keywords: DEFGRID2
keywords: scfconv7
keywords: smallprint printgap noloewdin
keywords: NOSOSCF
formula: C14H15N5O6S
InChI: InChI=1/C14H15N5O6S/c1-8-15-12(18-14(16-8)25-3)17-13(21)19-26(22,23)10-7-5-4-6-9(10)11(20)24-2/h4-7,17,19H,1-3H3
41 atoms
S  1.631542 0.372423 1.562514
O  1.556031 -1.041681 1.879942
O  2.11493 1.312095 2.549671
O  2.242273 -2.680389 -1.070786
O  0.415506 -1.399864 -0.930951
O  0.519175 2.914201 0.528226
O  -3.338194 -2.067927 0.825966
N  0.072187 0.773092 1.13626
N  -1.52635 2.086934 0.067384
N  -3.568464 1.538058 -0.778634
N  -2.371956 -0.034163 0.494928
N  -4.464717 -0.603841 -0.408822
C  2.590301 0.578554 0.083976
C  2.567945 -0.383516 -0.927719
C  3.437046 1.673231 0.011831
C  3.413746 -0.221467 -2.01619
C  4.257201 1.831411 -1.095029
C  4.244454 0.886453 -2.105746
C  1.612437 -1.532101 -0.953365
C  -0.250967 1.982369 0.58694
C  -2.517461 1.154282 -0.07128
C  -4.514234 0.615751 -0.926491
C  -3.378009 -0.870941 0.296854
C  1.440978 -3.860067 -1.197154
C  -5.696169 0.962206 -1.759854
C  -2.225007 -2.433158 1.642958
H  3.470142 2.400565 0.810035
H  -0.62166 0.016022 1.096863
H  3.412231 -0.954408 -2.812439
H  4.90999 2.691353 -1.156035
H  4.886944 1.002969 -2.968104
H  -6.593833 0.469975 -1.391065
H  -5.530131 0.613053 -2.782005
H  -5.853754 2.037535 -1.797941
H  2.141506 -4.685271 -1.28682
H  0.817058 -4.009718 -0.316037
H  -2.430011 -3.446226 1.978476
H  -1.293076 -2.425246 1.078175
H  -2.134668 -1.779698 2.510783
H  0.813795 -3.818277 -2.08751
H  -1.723528 2.983473 -0.361168
elementType: S O N C H
totalener: -1666.04042147 hartree
nucrepener: 2698.46235835 hartree
electener: -4364.50277983 hartree
oneelecener: -7647.92917859 hartree
twoeener: 3283.42639876 hartree
cpcmener: -0.04351709 hartree
kineticenergy: 1660.08915489 hartree
xcener: -135.881852302871 hartree
chargesum: -0.0000000
charge: 0.887683 -0.511001 -0.491025 -0.267327 -0.438408 -0.455575 -0.269125 -0.205119 -0.138288 -0.408014 -0.425873 -0.372529 -0.141542 0.079742 -0.005921 -0.198172 -0.162979 -0.104083 0.462142 0.373214 0.402223 0.325521 0.446025 -0.127758 -0.240135 -0.112937 0.147973 0.232597 0.148958 0.164495 0.164047 0.101811 0.114890 0.099573 0.132825 0.120304 0.136694 0.097173 0.124042 0.121256 0.192621
qa: 0.8877 -0.5110 -0.4910 -0.2673 -0.4384 -0.4556 -0.2691 -0.2051 -0.1383 -0.4080 -0.4259 -0.3725 -0.1415 0.0797 -0.0059 -0.1982 -0.1630 -0.1041 0.4621 0.3732 0.4022 0.3255 0.4460 -0.1278 -0.2401 -0.1129 0.1480 0.2326 0.1490 0.1645 0.1640 0.1018 0.1149 0.0996 0.1328 0.1203 0.1367 0.0972 0.1240 0.1213 0.1926
va: 5.8138 1.9779 2.0106 2.1455 2.0563 2.0631 2.1439 3.0890 3.2015 3.0185 2.9422 3.0017 3.7985 3.6891 3.8432 4.0333 3.9572 3.9034 4.0748 4.4128 4.2216 3.9625 4.2541 3.8656 3.9292 3.8503 1.0221 1.0342 1.0087 0.9883 0.9872 1.0111 0.9997 1.0136 0.9943 0.9881 0.9961 0.9967 0.9933 0.9924 1.0186
dispcorr: -0.022591901 hartree
energy: -1666.063013373674
dipole: -5.30226 5.40854 0.10629 -8.86328 7.81566 -1.04762 -9.14280 6.68761 -2.45519
magnitude: 2.67147 au
magnitude: 6.79033 debye
