program: Orca
programVersion: 5.0.2
elementType: S O O O O O O N N N N N C C C C C C C C C C C C C C H H H H H H H H H H H H H H H
charge: 0
multiplicity: 1
keywords: wb97x-d3
keywords: def2-TZVPP
keywords: def2/J RIJCOSX
keywords: DEFGRID2
keywords: scfconv7
keywords: smallprint printgap noloewdin
keywords: NOSOSCF
formula: C14H15N5O6S
InChI: InChI=1/C14H15N5O6S/c1-8-15-12(18-14(16-8)25-3)17-13(21)19-26(22,23)10-7-5-4-6-9(10)11(20)24-2/h4-7,17,19H,1-3H3
41 atoms
S  1.489781 0.118773 -1.606285
O  1.831811 0.892756 -2.778802
O  1.407251 -1.328039 -1.686582
O  2.426667 -2.490038 1.347044
O  0.586858 -1.223853 1.268108
O  0.449464 2.785362 -0.847099
O  -3.42661 -2.149211 -0.29838
N  -0.016312 0.575186 -1.065662
N  -1.581029 2.056042 -0.189785
N  -3.661032 1.679991 0.658206
N  -2.440885 -0.10093 -0.268576
N  -4.589585 -0.48028 0.603141
C  2.614102 0.549651 -0.302731
C  2.713556 -0.239569 0.844572
C  3.461262 1.627119 -0.507162
C  3.681211 0.078406 1.78761
C  4.408817 1.942212 0.454902
C  4.51642 1.170644 1.599102
C  1.777549 -1.363092 1.152997
C  -0.321095 1.860113 -0.721329
C  -2.590755 1.171371 0.072718
C  -4.63429 0.807881 0.909682
C  -3.47167 -0.878822 0.014772
C  1.655986 -3.63507 1.725607
C  -5.841978 1.321088 1.60961
C  -2.263055 -2.661789 -0.950821
H  3.397646 2.217264 -1.410042
H  -0.708521 -0.16346 -0.885857
H  3.776126 -0.519573 2.684485
H  5.065382 2.787363 0.300105
H  5.257125 1.411308 2.349805
H  -6.138614 2.290988 1.213204
H  -5.615176 1.46342 2.668814
H  -6.671818 0.623406 1.531739
H  1.115932 -3.461207 2.656009
H  0.95221 -3.91172 0.940454
H  -2.081552 -2.158526 -1.90053
H  -1.38197 -2.578569 -0.315079
H  -2.47266 -3.711683 -1.136863
H  2.370937 -4.44001 1.867806
H  -1.775309 3.013943 0.077008
elementType: S O N C H
totalener: -1666.04088763 hartree
nucrepener: 2688.76884331 hartree
electener: -4354.80973093 hartree
oneelecener: -7628.55029050 hartree
twoeener: 3273.74055957 hartree
cpcmener: -0.04364541 hartree
kineticenergy: 1660.09058789 hartree
xcener: -135.882647100861 hartree
chargesum: -0.0000000
charge: 0.884857 -0.490562 -0.511710 -0.266668 -0.436594 -0.457683 -0.269386 -0.200681 -0.137232 -0.413552 -0.427535 -0.368345 -0.132692 0.076253 -0.008988 -0.196245 -0.162884 -0.104716 0.454635 0.373670 0.399134 0.325757 0.451200 -0.128220 -0.237398 -0.111174 0.148927 0.232737 0.149319 0.164252 0.163616 0.103486 0.112712 0.097864 0.120192 0.120994 0.120160 0.100386 0.136654 0.133235 0.192224
qa: 0.8849 -0.4906 -0.5117 -0.2667 -0.4366 -0.4577 -0.2694 -0.2007 -0.1372 -0.4136 -0.4275 -0.3683 -0.1327 0.0763 -0.0090 -0.1962 -0.1629 -0.1047 0.4546 0.3737 0.3991 0.3258 0.4512 -0.1282 -0.2374 -0.1112 0.1489 0.2327 0.1493 0.1643 0.1636 0.1035 0.1127 0.0979 0.1202 0.1210 0.1202 0.1004 0.1367 0.1332 0.1922
va: 5.8129 2.0126 1.9753 2.1448 2.0578 2.0628 2.1459 3.0937 3.2014 3.0128 2.9446 3.0082 3.7971 3.6961 3.8458 4.0334 3.9544 3.9031 4.0793 4.4145 4.2319 3.9642 4.2415 3.8650 3.9297 3.8500 1.0208 1.0321 1.0082 0.9884 0.9873 1.0079 1.0006 1.0162 0.9931 0.9881 0.9939 0.9996 0.9964 0.9944 1.0187
dispcorr: -0.022400136 hartree
energy: -1666.063287763031
dipole: -4.35798 4.74854 0.39055 -7.23846 6.58239 -0.65607 9.98468 -7.53879 2.44589
magnitude: 2.56230 au
magnitude: 6.51284 debye
