program: Orca
programVersion: 5.0.2
elementType: S O O O O O O N N N N N C C C C C C C C C C C C C C H H H H H H H H H H H H H H H
charge: 0
multiplicity: 1
keywords: wb97x-d3
keywords: def2-TZVPP
keywords: def2/J RIJCOSX
keywords: DEFGRID2
keywords: scfconv7
keywords: smallprint printgap noloewdin
keywords: NOSOSCF
formula: C14H15N5O6S
InChI: InChI=1/C14H15N5O6S/c1-8-15-12(18-14(16-8)25-3)17-13(21)19-26(22,23)10-7-5-4-6-9(10)11(20)24-2/h4-7,17,19H,1-3H3
41 atoms
S  1.603683 0.399661 1.576174
O  1.50649 -1.005926 1.907464
O  2.082936 1.361176 2.534981
O  2.3058 -2.712859 -1.118676
O  0.475162 -1.467403 -0.820716
O  0.49679 2.938874 0.421708
O  -3.336766 -2.067034 0.798401
N  0.055124 0.807695 1.097886
N  -1.551196 2.091837 0.00649
N  -3.620181 1.553582 -0.77297
N  -2.388743 -0.030052 0.45513
N  -4.515902 -0.587816 -0.376826
C  2.580943 0.576076 0.096243
C  2.612934 -0.416852 -0.883683
C  3.39535 1.692801 0.006301
C  3.49602 -0.272022 -1.94592
C  4.246837 1.836148 -1.077865
C  4.301089 0.852014 -2.048496
C  1.667885 -1.573243 -0.907042
C  -0.257158 2.005968 0.518435
C  -2.547726 1.163349 -0.101923
C  -4.574626 0.633952 -0.882021
C  -3.402049 -0.864777 0.28294
C  1.505856 -3.887219 -1.208546
C  -5.791647 1.003053 -1.660606
C  -2.172349 -2.437446 1.528754
H  3.364878 2.445107 0.780288
H  -0.624214 0.04515 1.022478
H  3.545964 -1.036904 -2.708647
H  4.87208 2.714912 -1.154012
H  4.973027 0.953289 -2.889945
H  -5.586561 0.891908 -2.727203
H  -6.059704 2.043448 -1.490378
H  -6.624165 0.352417 -1.408031
H  0.959202 -4.062582 -0.282273
H  0.795127 -3.827782 -2.032638
H  -1.279224 -2.407307 0.905113
H  -2.022201 -1.798026 2.399261
H  -2.350714 -3.456007 1.861548
H  2.197989 -4.705968 -1.381044
H  -1.755983 2.976744 -0.434557
totalener: -1666.00837359 hartree
nucrepener: 2694.83562500 hartree
electener: -4360.84399859 hartree
oneelecener: -7639.86862020 hartree
twoeener: 3279.02462161 hartree
kineticenergy: 1660.16154613 hartree
xcener: -135.885904048819 hartree
chargesum: -0.0000000
charge: 0.872125 -0.470500 -0.431494 -0.256175 -0.389413 -0.373470 -0.234257 -0.208798 -0.166498 -0.376002 -0.420700 -0.307378 -0.200204 0.093138 0.040836 -0.185445 -0.139996 -0.090714 0.425633 0.342546 0.386218 0.262930 0.420687 -0.134038 -0.230039 -0.129892 0.137888 0.210054 0.121561 0.135304 0.133673 0.096508 0.099693 0.104433 0.111608 0.113021 0.101450 0.114274 0.124907 0.124515 0.172013
qa: 0.8721 -0.4705 -0.4315 -0.2562 -0.3894 -0.3735 -0.2343 -0.2088 -0.1665 -0.3760 -0.4207 -0.3074 -0.2002 0.0931 0.0408 -0.1854 -0.1400 -0.0907 0.4256 0.3425 0.3862 0.2629 0.4207 -0.1340 -0.2300 -0.1299 0.1379 0.2101 0.1216 0.1353 0.1337 0.0965 0.0997 0.1044 0.1116 0.1130 0.1015 0.1143 0.1249 0.1245 0.1720
va: 5.8358 2.0236 2.0797 2.1415 2.1033 2.1456 2.1733 3.1023 3.1812 3.0179 2.9574 3.0222 3.9430 3.6802 3.8622 4.0730 3.9802 3.9434 4.1073 4.4136 4.2144 4.0244 4.2523 3.8941 3.9114 3.8761 1.0289 1.0531 1.0212 0.9989 0.9982 1.0047 1.0108 1.0155 0.9923 0.9937 0.9997 0.9956 0.9978 0.9952 1.0350
dispcorr: -0.022516866 hartree
energy: -1666.030890457849
dipole: -5.11125 5.25615 0.14490 -8.88034 8.04730 -0.83304 -9.18840 7.40112 -1.78728
magnitude: 1.97720 au
magnitude: 5.02565 debye
