program: Orca
programVersion: 5.0.2
elementType: Cl Cl S O O O O N N N N N C C C C C C C C C C C C C C H H H H H H H H H H H H H
charge: 0
multiplicity: 1
keywords: wb97x-d3
keywords: def2-TZVPP
keywords: def2/J RIJCOSX
keywords: DEFGRID2
keywords: scfconv7
keywords: smallprint printgap noloewdin
keywords: NOSOSCF
formula: C14H13Cl2N5O4S
InChI: InChI=1/C14H13Cl2N5O4S/c1-7-4-5-8(15)12(11(7)16)20-26(22,23)14-18-13-17-9(24-2)6-10(25-3)21(13)19-14/h4-6,20H,1-3H3
39 atoms
Cl 0.231317 -2.052244 0.071351
Cl 4.658761 0.936097 -0.661669
S  1.186634 1.078705 -1.883586
O  -3.95401 -0.476835 -1.859533
O  1.84473 2.21671 -1.283608
O  0.941982 0.993843 -3.307401
O  -4.265521 0.361212 2.771851
N  -2.2648 0.362619 -0.645707
N  2.056768 -0.276818 -1.488718
N  -1.399175 0.418228 -1.662421
N  -0.450714 1.18401 0.253974
N  -2.325905 0.828558 1.675933
C  -0.359401 0.905658 -1.042478
C  2.418256 -0.492183 -0.142077
C  -1.687324 0.808702 0.511798
C  -3.554854 -0.087961 -0.680018
C  1.636802 -1.274631 0.712303
C  1.949859 -1.464881 2.054092
C  3.586646 0.06932 0.369248
C  -4.23407 -0.075833 0.502031
C  3.099506 -0.840705 2.527191
C  -3.559231 0.391381 1.658661
C  3.919819 -0.092168 1.702667
C  1.087663 -2.285636 2.958848
C  -5.285378 -0.987628 -1.984047
C  -3.642825 0.773306 3.988049
H  1.773998 -1.096309 -2.021347
H  -5.255232 -0.419982 0.570005
H  3.365572 -0.954442 3.56987
H  4.820095 0.357978 2.096586
H  1.490307 -2.287986 3.969686
H  0.069941 -1.894791 3.003926
H  1.022582 -3.321105 2.622116
H  -6.018722 -0.228021 -1.713803
H  -5.418222 -1.874265 -1.364484
H  -5.404299 -1.252744 -3.02956
H  -2.788997 0.141634 4.230525
H  -3.323285 1.813724 3.94223
H  -4.402026 0.663208 4.757023
elementType: Cl S O N C H
totalener: -2434.69167902 hartree
nucrepener: 3052.09354507 hartree
electener: -5486.78522409 hartree
oneelecener: -9418.21012286 hartree
twoeener: 3931.42489877 hartree
cpcmener: -0.05723903 hartree
kineticenergy: 2428.10161445 hartree
xcener: -165.340318382280 hartree
chargesum: -0.0000000
charge: -0.074500 -0.063669 0.876386 -0.278837 -0.493826 -0.512980 -0.285903 0.173011 -0.216781 -0.295966 -0.329887 -0.396683 0.011714 0.277457 0.233118 0.377386 -0.145033 0.077232 -0.086732 -0.261569 -0.167573 0.410335 -0.070124 -0.210448 -0.127509 -0.115471 0.189256 0.144134 0.148563 0.143806 0.095447 0.103075 0.109054 0.132708 0.133636 0.132667 0.116557 0.114886 0.133064
qa: -0.0745 -0.0637 0.8764 -0.2788 -0.4938 -0.5130 -0.2859 0.1730 -0.2168 -0.2960 -0.3299 -0.3967 0.0117 0.2775 0.2331 0.3774 -0.1450 0.0772 -0.0867 -0.2616 -0.1676 0.4103 -0.0701 -0.2104 -0.1275 -0.1155 0.1893 0.1441 0.1486 0.1438 0.0954 0.1031 0.1091 0.1327 0.1336 0.1327 0.1166 0.1149 0.1331
va: 1.2829 1.2542 5.8183 2.1743 1.9994 1.9897 2.1430 3.3234 3.0451 2.8865 2.9850 2.9493 4.2702 3.4981 4.3663 4.0701 4.0930 3.6359 4.0629 3.8830 3.9541 4.0307 3.9306 3.8988 3.8332 3.8460 1.0237 1.0173 0.9961 1.0051 1.0057 0.9997 0.9975 0.9856 0.9857 0.9922 0.9944 0.9966 0.9934
dispcorr: -0.022536215 hartree
energy: -2434.714215234816
dipole: -25.23966 21.10515 -4.13451 -8.49432 5.19515 -3.29917 19.85895 -16.85433 3.00462
magnitude: 6.08329 au
magnitude: 15.46249 debye
