program: Orca
programVersion: 5.0.2
elementType: Cl Cl S O O O O N N N N N C C C C C C C C C C C C C C H H H H H H H H H H H H H
charge: 0
multiplicity: 1
keywords: wb97x-d3
keywords: def2-TZVPP
keywords: def2/J RIJCOSX
keywords: DEFGRID2
keywords: scfconv7
keywords: smallprint printgap noloewdin
keywords: NOSOSCF
formula: C14H13Cl2N5O4S
InChI: InChI=1/C14H13Cl2N5O4S/c1-7-4-5-8(15)12(11(7)16)20-26(22,23)14-18-13-17-9(24-2)6-10(25-3)21(13)19-14/h4-6,20H,1-3H3
39 atoms
Cl 4.467151 0.090346 1.225814
Cl 0.175115 0.3297 -2.028539
S  1.21684 -1.550136 1.163787
O  -2.737942 2.015361 1.0655
O  1.351421 -2.989361 1.202762
O  1.56748 -0.710321 2.287602
O  -5.461617 -0.871482 -1.480933
N  -2.128433 -0.064318 0.490862
N  2.100643 -1.029969 -0.13632
N  -0.930707 0.002325 1.07503
N  -1.218428 -2.00153 0.044777
N  -3.408842 -1.583247 -0.796035
C  -0.461925 -1.174272 0.757094
C  2.283516 0.355017 -0.328943
C  -2.300583 -1.269318 -0.133868
C  -3.076563 0.918152 0.444827
C  3.340098 1.012697 0.305399
C  3.535906 2.387724 0.191958
C  1.444597 1.106588 -1.152125
C  -4.220141 0.624612 -0.235186
C  2.652373 3.09321 -0.617923
C  -4.330856 -0.655148 -0.838154
C  1.625772 2.467856 -1.303061
C  4.655152 3.087637 0.895237
C  -3.665117 3.105441 1.056064
C  -5.661313 -2.12559 -2.130584
H  1.994811 -1.607432 -0.966698
H  -5.024695 1.339183 -0.325238
H  2.779218 4.162552 -0.724635
H  0.967483 3.039153 -1.94229
H  4.609769 2.933474 1.973872
H  5.62856 2.728307 0.558763
H  4.611652 4.158582 0.707448
H  -3.854365 3.443015 0.037099
H  -3.191809 3.90172 1.621084
H  -4.601303 2.822054 1.536612
H  -4.913709 -2.299477 -2.903779
H  -5.646977 -2.950757 -1.41946
H  -6.644049 -2.063697 -2.589062
elementType: Cl S O N C H
totalener: -2434.69257477 hartree
nucrepener: 3032.65809971 hartree
electener: -5467.35067448 hartree
oneelecener: -9379.28992466 hartree
twoeener: 3911.93925018 hartree
cpcmener: -0.05717115 hartree
kineticenergy: 2428.09989749 hartree
xcener: -165.340608333099 hartree
chargesum: -0.0000000
charge: -0.061533 -0.072242 0.875463 -0.279416 -0.510348 -0.498380 -0.285287 0.171392 -0.217642 -0.310931 -0.323844 -0.394340 0.024336 0.224813 0.232985 0.369442 -0.110000 0.066245 -0.063808 -0.255985 -0.153567 0.408695 -0.080813 -0.217618 -0.127495 -0.114948 0.193230 0.144415 0.149103 0.147285 0.106810 0.106499 0.094818 0.132753 0.132626 0.133040 0.115778 0.115876 0.132595
qa: -0.0615 -0.0722 0.8755 -0.2794 -0.5103 -0.4984 -0.2853 0.1714 -0.2176 -0.3109 -0.3238 -0.3943 0.0243 0.2248 0.2330 0.3694 -0.1100 0.0662 -0.0638 -0.2560 -0.1536 0.4087 -0.0808 -0.2176 -0.1275 -0.1149 0.1932 0.1444 0.1491 0.1473 0.1068 0.1065 0.0948 0.1328 0.1326 0.1330 0.1158 0.1159 0.1326
va: 1.2843 1.2611 5.8168 2.1702 1.9979 1.9906 2.1431 3.3202 3.0445 2.8476 3.0303 2.9689 4.2706 3.5980 4.3753 4.0728 4.1147 3.6458 3.9999 3.8782 3.9362 4.0374 3.9423 3.9131 3.8337 3.8417 1.0188 1.0171 0.9953 1.0015 0.9979 0.9978 1.0057 0.9860 0.9924 0.9856 0.9963 0.9961 0.9935
dispcorr: -0.022056064 hartree
energy: -2434.714630835053
dipole: -18.31925 15.04543 -3.27382 17.03601 -12.55178 4.48424 -3.66331 1.28870 -2.37461
magnitude: 6.03863 au
magnitude: 15.34898 debye
