program: Orca
programVersion: 5.0.2
elementType: Cl Cl S O O O O N N N N N C C C C C C C C C C C C C C H H H H H H H H H H H H H
charge: 0
multiplicity: 1
keywords: wb97x-d3
keywords: def2-TZVPP
keywords: def2/J RIJCOSX
keywords: DEFGRID2
keywords: scfconv7
keywords: smallprint printgap noloewdin
keywords: NOSOSCF
formula: C14H13Cl2N5O4S
InChI: InChI=1/C14H13Cl2N5O4S/c1-7-4-5-8(15)12(11(7)16)20-26(22,23)14-18-13-17-9(24-2)6-10(25-3)21(13)19-14/h4-6,20H,1-3H3
39 atoms
Cl 4.18547 1.333732 -1.320923
Cl 0.50496 -1.409666 1.507369
S  1.010941 -0.265603 -2.127295
O  -2.477821 1.897347 1.231504
O  1.239584 1.134158 -2.405846
O  1.071461 -1.276743 -3.158994
O  -5.280708 -1.887369 1.031084
N  -2.074528 0.136442 -0.091634
N  2.094441 -0.727925 -0.961659
N  -0.944658 0.634024 -0.593919
N  -1.337092 -1.452814 -1.399992
N  -3.38282 -1.830375 -0.231709
C  -0.572963 -0.367291 -1.345442
C  2.298344 0.105287 0.157754
C  -2.313177 -1.120743 -0.576467
C  -2.887339 0.723819 0.835282
C  3.228971 1.14464 0.098737
C  3.438786 2.015789 1.166663
C  1.608281 -0.088284 1.354911
C  -3.986365 0.013475 1.213218
C  2.704974 1.793285 2.326422
C  -4.188606 -1.265055 0.631801
C  1.810359 0.743734 2.438843
C  4.420121 3.141142 1.085949
C  -3.225026 2.561906 2.254728
C  -5.566081 -3.186048 0.514414
H  2.102773 -1.731364 -0.794302
H  -4.688154 0.397052 1.938745
H  2.847936 2.453607 3.171846
H  1.269264 0.583643 3.360778
H  4.401084 3.728991 2.001532
H  5.43826 2.776281 0.943224
H  4.197127 3.808806 0.252912
H  -3.244494 1.965201 3.166543
H  -4.241729 2.769239 1.921245
H  -2.704984 3.495912 2.441202
H  -4.784038 -3.899481 0.771991
H  -6.496962 -3.489085 0.985184
H  -5.698813 -3.165753 -0.566645
elementType: Cl S O N C H
totalener: -2434.69168172 hartree
nucrepener: 3046.24058890 hartree
electener: -5480.93227062 hartree
oneelecener: -9406.34792982 hartree
twoeener: 3925.41565920 hartree
cpcmener: -0.05726638 hartree
kineticenergy: 2428.10483721 hartree
xcener: -165.341237722072 hartree
chargesum: -0.0000000
charge: -0.061073 -0.073270 0.877346 -0.279649 -0.496033 -0.510706 -0.285329 0.165960 -0.212114 -0.315398 -0.320380 -0.394490 0.020746 0.221690 0.238422 0.370463 -0.109121 0.060581 -0.061182 -0.255166 -0.151886 0.410504 -0.082311 -0.217599 -0.129116 -0.115289 0.190330 0.144569 0.149731 0.147694 0.094529 0.106773 0.106695 0.133636 0.133242 0.132845 0.115684 0.133104 0.115570
qa: -0.0611 -0.0733 0.8773 -0.2796 -0.4960 -0.5107 -0.2853 0.1660 -0.2121 -0.3154 -0.3204 -0.3945 0.0207 0.2217 0.2384 0.3705 -0.1091 0.0606 -0.0612 -0.2552 -0.1519 0.4105 -0.0823 -0.2176 -0.1291 -0.1153 0.1903 0.1446 0.1497 0.1477 0.0945 0.1068 0.1067 0.1336 0.1332 0.1328 0.1157 0.1331 0.1156
va: 1.2846 1.2609 5.8137 2.1663 1.9928 1.9983 2.1424 3.3269 3.0513 2.8430 3.0336 2.9701 4.2712 3.5854 4.3661 4.0688 4.1181 3.6468 4.0055 3.8810 3.9327 4.0357 3.9432 3.9130 3.8332 3.8418 1.0217 1.0171 0.9949 1.0015 1.0054 0.9978 0.9982 0.9862 0.9853 0.9923 0.9964 0.9933 0.9963
dispcorr: -0.022362675 hartree
energy: -2434.714044395284
dipole: -16.90987 14.30005 -2.60983 8.59544 -7.28815 1.30729 18.00341 -12.51339 5.49003
magnitude: 6.21777 au
magnitude: 15.80431 debye
