program: Orca
programVersion: 5.0.2
elementType: Cl Cl S O O O O N N N N N C C C C C C C C C C C C C C H H H H H H H H H H H H H
charge: 0
multiplicity: 1
keywords: wb97x-d3
keywords: def2-TZVPP
keywords: def2/J RIJCOSX
keywords: DEFGRID2
keywords: scfconv7
keywords: smallprint printgap noloewdin
keywords: NOSOSCF
formula: C14H13Cl2N5O4S
InChI: InChI=1/C14H13Cl2N5O4S/c1-7-4-5-8(15)12(11(7)16)20-26(22,23)14-18-13-17-9(24-2)6-10(25-3)21(13)19-14/h4-6,20H,1-3H3
39 atoms
Cl 4.207156 1.3053 -1.357506
Cl 0.53514 -1.375822 1.536765
S  0.986458 -0.228772 -2.097464
O  -2.572919 1.927048 1.223464
O  1.220953 1.173284 -2.359861
O  1.025686 -1.225959 -3.143736
O  -5.312337 -1.903938 1.008792
N  -2.110912 0.155549 -0.068613
N  2.084241 -0.716015 -0.957111
N  -0.98152 0.665385 -0.562672
N  -1.339828 -1.431047 -1.360903
N  -3.392995 -1.828157 -0.217564
C  -0.5909 -0.335752 -1.304743
C  2.329766 0.108514 0.1598
C  -2.328117 -1.106402 -0.550002
C  -2.953936 0.742408 0.832054
C  3.28174 1.127215 0.084208
C  3.537011 1.985406 1.152291
C  1.661411 -0.076487 1.370026
C  -4.05044 0.020187 1.195476
C  2.823333 1.773146 2.326654
C  -4.222992 -1.267128 0.625046
C  1.906057 0.744968 2.453311
C  4.54536 3.085332 1.057031
C  -3.366864 2.596104 2.208163
C  -5.561839 -3.212123 0.496978
H  2.078877 -1.720139 -0.794036
H  -4.772235 0.402726 1.90156
H  3.001507 2.424171 3.172518
H  1.381642 0.592846 3.386119
H  5.549265 2.694868 0.884596
H  4.319507 3.767222 0.236447
H  4.565761 3.663839 1.978358
H  -3.407003 2.01596 3.129958
H  -4.375318 2.777283 1.836416
H  -2.871666 3.543444 2.394548
H  -4.772191 -3.908262 0.777751
H  -6.497209 -3.529347 0.948791
H  -5.669841 -3.203511 -0.587027
elementType: Cl S O N C H
totalener: -2434.69235002 hartree
nucrepener: 3036.98489030 hartree
electener: -5471.67724032 hartree
oneelecener: -9387.88727282 hartree
twoeener: 3916.21003250 hartree
cpcmener: -0.05730175 hartree
kineticenergy: 2428.11206898 hartree
xcener: -165.342394021048 hartree
chargesum: 0.0000000
charge: -0.061094 -0.072734 0.877297 -0.279314 -0.496954 -0.511143 -0.285557 0.168612 -0.213647 -0.314421 -0.320488 -0.395213 0.018957 0.220452 0.239851 0.371587 -0.107238 0.061218 -0.062159 -0.257134 -0.151994 0.410202 -0.081798 -0.217923 -0.128167 -0.114862 0.190775 0.144299 0.149574 0.147984 0.106769 0.106894 0.094459 0.133490 0.132722 0.132773 0.115507 0.133087 0.115332
qa: -0.0611 -0.0727 0.8773 -0.2793 -0.4970 -0.5111 -0.2856 0.1686 -0.2136 -0.3144 -0.3205 -0.3952 0.0190 0.2205 0.2399 0.3716 -0.1072 0.0612 -0.0622 -0.2571 -0.1520 0.4102 -0.0818 -0.2179 -0.1282 -0.1149 0.1908 0.1443 0.1496 0.1480 0.1068 0.1069 0.0945 0.1335 0.1327 0.1328 0.1155 0.1331 0.1153
va: 1.2845 1.2611 5.8145 2.1691 1.9924 1.9977 2.1426 3.3245 3.0498 2.8469 3.0320 2.9699 4.2754 3.5927 4.3657 4.0711 4.1157 3.6468 4.0042 3.8794 3.9329 4.0357 3.9447 3.9130 3.8334 3.8418 1.0214 1.0174 0.9951 1.0013 0.9978 0.9981 1.0055 0.9861 0.9855 0.9923 0.9965 0.9933 0.9965
dispcorr: -0.022118414 hartree
energy: -2434.714468430080
dipole: -16.84870 14.24039 -2.60832 8.34327 -7.08692 1.25635 17.66349 -12.24270 5.42079
magnitude: 6.14546 au
magnitude: 15.62052 debye
