program: Orca
programVersion: 5.0.2
elementType: Cl Cl S O O O O N N N N N C C C C C C C C C C C C C C H H H H H H H H H H H H H
charge: 0
multiplicity: 1
keywords: wb97x-d3
keywords: def2-TZVPP
keywords: def2/J RIJCOSX
keywords: DEFGRID2
keywords: scfconv7
keywords: smallprint printgap noloewdin
keywords: NOSOSCF
formula: C14H13Cl2N5O4S
InChI: InChI=1/C14H13Cl2N5O4S/c1-7-4-5-8(15)12(11(7)16)20-26(22,23)14-18-13-17-9(24-2)6-10(25-3)21(13)19-14/h4-6,20H,1-3H3
39 atoms
Cl 4.200349 1.909263 0.262524
Cl 0.635699 -2.061278 -0.486851
S  0.882435 1.691028 -1.266802
O  -3.773842 -0.694693 -2.429654
O  1.197861 2.693596 -0.274849
O  0.747566 2.016566 -2.670744
O  -4.603641 -1.515822 2.141163
N  -2.386263 -0.048838 -0.791694
N  2.033187 0.503651 -1.186757
N  -1.485396 0.500298 -1.611047
N  -0.862278 0.741793 0.56002
N  -2.720741 -0.390539 1.527708
C  -0.623169 0.933706 -0.733275
C  2.381047 -0.065931 0.055494
C  -2.004516 0.085328 0.515394
C  -3.551132 -0.670303 -1.144108
C  3.361437 0.525784 0.853558
C  3.714135 0.010229 2.10011
C  1.795454 -1.25031 0.504191
C  -4.304478 -1.169905 -0.123882
C  3.078626 -1.156326 2.511442
C  -3.831643 -1.002143 1.20327
C  2.14165 -1.80033 1.722627
C  4.745376 0.664068 2.963879
C  -4.985979 -1.300719 -2.889131
C  -4.202088 -1.39395 3.505174
H  2.000218 -0.129625 -1.981705
H  -5.237183 -1.682269 -0.307079
H  3.336244 -1.582202 3.472369
H  1.680118 -2.717453 2.060741
H  4.859344 0.118641 3.898586
H  5.719759 0.695972 2.474749
H  4.472197 1.691975 3.205184
H  -4.975734 -1.201938 -3.969664
H  -5.854769 -0.782809 -2.48283
H  -5.018328 -2.355851 -2.618122
H  -4.981466 -1.881023 4.084003
H  -3.251741 -1.894548 3.687274
H  -4.126547 -0.350236 3.807953
elementType: Cl S O N C H
totalener: -2434.69218955 hartree
nucrepener: 3019.43218656 hartree
electener: -5454.12437611 hartree
oneelecener: -9353.20504714 hartree
twoeener: 3899.08067103 hartree
cpcmener: -0.05673944 hartree
kineticenergy: 2428.09682343 hartree
xcener: -165.339345234272 hartree
chargesum: 0.0000000
charge: -0.060846 -0.074040 0.877391 -0.278633 -0.494783 -0.514298 -0.285834 0.174977 -0.213637 -0.296217 -0.333603 -0.394119 0.010886 0.240096 0.234459 0.377102 -0.114024 0.061272 -0.077247 -0.262159 -0.155275 0.409415 -0.072793 -0.217976 -0.126984 -0.115766 0.189973 0.144613 0.149678 0.147401 0.094794 0.105521 0.107603 0.132617 0.132930 0.132366 0.133111 0.115934 0.116098
qa: -0.0608 -0.0740 0.8774 -0.2786 -0.4948 -0.5143 -0.2858 0.1750 -0.2136 -0.2962 -0.3336 -0.3941 0.0109 0.2401 0.2345 0.3771 -0.1140 0.0613 -0.0772 -0.2622 -0.1553 0.4094 -0.0728 -0.2180 -0.1270 -0.1158 0.1900 0.1446 0.1497 0.1474 0.0948 0.1055 0.1076 0.1326 0.1329 0.1324 0.1331 0.1159 0.1161
va: 1.2847 1.2566 5.8187 2.1743 1.9985 1.9882 2.1427 3.3183 3.0534 2.8859 2.9860 2.9659 4.2749 3.5453 4.3771 4.0734 4.1246 3.6445 4.0195 3.8813 3.9363 4.0345 3.9311 3.9143 3.8338 3.8412 1.0227 1.0170 0.9950 1.0010 1.0056 0.9983 0.9976 0.9922 0.9860 0.9855 0.9933 0.9965 0.9964
dispcorr: -0.021796099 hartree
energy: -2434.713985648163
dipole: -16.90369 13.87460 -3.02909 -11.21218 6.88488 -4.32729 14.05282 -12.73881 1.31402
magnitude: 5.44311 au
magnitude: 13.83530 debye
