program: Orca
programVersion: 5.0.2
elementType: Cl Cl S O O O O N N N N N C C C C C C C C C C C C C C H H H H H H H H H H H H H
charge: 0
multiplicity: 1
keywords: wb97x-d3
keywords: def2-TZVPP
keywords: def2/J RIJCOSX
keywords: DEFGRID2
keywords: scfconv7
keywords: smallprint printgap noloewdin
keywords: NOSOSCF
formula: C14H13Cl2N5O4S
InChI: InChI=1/C14H13Cl2N5O4S/c1-7-4-5-8(15)12(11(7)16)20-26(22,23)14-18-13-17-9(24-2)6-10(25-3)21(13)19-14/h4-6,20H,1-3H3
39 atoms
Cl 4.24468 0.839203 1.742706
Cl 0.610246 -1.110574 -1.722176
S  0.859414 -0.395498 2.074537
O  -2.634972 2.052327 -1.115985
O  0.815801 -1.428097 3.084372
O  1.120065 0.991092 2.384882
O  -5.243334 -1.859361 -1.511064
N  -2.162432 0.14211 -0.049549
N  1.981115 -0.87241 0.958599
N  -1.06766 0.62134 0.546956
N  -1.409814 -1.548637 1.108226
N  -3.403751 -1.868479 -0.176219
C  -0.681939 -0.437634 1.209366
C  2.399043 0.027517 -0.039531
C  -2.37555 -1.170102 0.290799
C  -2.990072 0.8168 -0.89863
C  3.42897 0.932637 0.22808
C  3.841993 1.886218 -0.700313
C  1.820919 0.048705 -1.309084
C  -4.050593 0.117292 -1.394316
C  3.209661 1.883679 -1.93892
C  -4.205047 -1.235824 -0.993531
C  2.224312 0.967011 -2.259667
C  4.925778 2.870919 -0.395979
C  -3.445871 2.845687 -1.985196
C  -5.460789 -3.225041 -1.162215
H  1.986337 -1.867574 0.75275
H  -4.757209 0.566231 -2.076373
H  3.50801 2.612486 -2.681648
H  1.768692 0.976229 -3.240113
H  4.696395 3.460315 0.492839
H  5.881402 2.375673 -0.216394
H  5.060019 3.560605 -1.22755
H  -3.468003 2.423047 -2.99027
H  -2.978299 3.825093 -2.014774
H  -4.460073 2.938959 -1.595364
H  -6.352569 -3.527528 -1.704624
H  -4.623345 -3.853859 -1.464897
H  -5.630882 -3.342868 -0.091957
elementType: Cl S O N C H
totalener: -2434.69235087 hartree
nucrepener: 3023.22619570 hartree
electener: -5457.91854657 hartree
oneelecener: -9360.38297972 hartree
twoeener: 3902.46443315 hartree
cpcmener: -0.04831868 hartree
kineticenergy: 2428.06912945 hartree
xcener: -165.335181544797 hartree
chargesum: -0.0000000
charge: -0.058950 -0.073248 0.864110 -0.269235 -0.495812 -0.484923 -0.280458 0.163043 -0.228313 -0.309807 -0.323364 -0.389000 0.033549 0.219524 0.234592 0.365885 -0.099823 0.065320 -0.059296 -0.263563 -0.151048 0.403632 -0.086167 -0.219144 -0.131136 -0.114169 0.195835 0.140797 0.145021 0.143993 0.107126 0.107511 0.092363 0.130492 0.132773 0.130917 0.130904 0.114634 0.115434
qa: -0.0589 -0.0732 0.8641 -0.2692 -0.4958 -0.4849 -0.2805 0.1630 -0.2283 -0.3098 -0.3234 -0.3890 0.0335 0.2195 0.2346 0.3659 -0.0998 0.0653 -0.0593 -0.2636 -0.1510 0.4036 -0.0862 -0.2191 -0.1311 -0.1142 0.1958 0.1408 0.1450 0.1440 0.1071 0.1075 0.0924 0.1305 0.1328 0.1309 0.1309 0.1146 0.1154
va: 1.2870 1.2583 5.8455 2.1797 2.0173 2.0068 2.1488 3.3194 3.0434 2.8421 3.0388 2.9703 4.2598 3.6112 4.3705 4.0796 4.1124 3.6513 4.0056 3.8768 3.9389 4.0461 3.9521 3.9159 3.8395 3.8443 1.0157 1.0187 0.9965 1.0032 0.9981 0.9974 1.0058 0.9856 0.9927 0.9860 0.9933 0.9972 0.9969
dispcorr: -0.021914584 hartree
energy: -2434.714265454285
dipole: -15.31348 13.17028 -2.14320 9.62878 -8.04826 1.58052 -16.78313 11.84464 -4.93849
magnitude: 5.61071 au
magnitude: 14.26129 debye
