program: Orca
programVersion: 5.0.2
elementType: Cl Cl S O O O O N N N N N C C C C C C C C C C C C C C H H H H H H H H H H H H H
charge: 0
multiplicity: 1
keywords: wb97x-d3
keywords: def2-TZVPP
keywords: def2/J RIJCOSX
keywords: DEFGRID2
keywords: scfconv7
keywords: smallprint printgap noloewdin
keywords: NOSOSCF
formula: C14H13Cl2N5O4S
InChI: InChI=1/C14H13Cl2N5O4S/c1-7-4-5-8(15)12(11(7)16)20-26(22,23)14-18-13-17-9(24-2)6-10(25-3)21(13)19-14/h4-6,20H,1-3H3
39 atoms
Cl 4.190766 1.911459 0.260242
Cl 0.646892 -2.091573 -0.404556
S  0.872455 1.6725 -1.220098
O  -3.738229 -0.770317 -2.441392
O  1.185547 2.655432 -0.210695
O  0.74853 2.005366 -2.621692
O  -4.705274 -1.477503 2.122874
N  -2.405149 -0.084519 -0.778653
N  2.0152 0.476323 -1.140522
N  -1.487516 0.453218 -1.588182
N  -0.912021 0.734534 0.58627
N  -2.807684 -0.373324 1.536476
C  -0.641766 0.914935 -0.706454
C  2.384545 -0.079534 0.099656
C  -2.058716 0.082476 0.540082
C  -3.55656 -0.715157 -1.151125
C  3.376106 0.52425 0.875541
C  3.760472 0.014221 2.115376
C  1.814262 -1.26459 0.56674
C  -4.341447 -1.192186 -0.14274
C  3.141534 -1.155114 2.544436
C  -3.908102 -0.990749 1.193779
C  2.189711 -1.807082 1.779713
C  4.80778 0.676949 2.953465
C  -4.925498 -1.394624 -2.931555
C  -4.337503 -1.307016 3.490326
H  1.980406 -0.160165 -1.932604
H  -5.269258 -1.708427 -0.339978
H  3.422203 -1.577742 3.500485
H  1.740714 -2.725837 2.131336
H  4.535043 1.70415 3.198648
H  4.947461 0.136442 3.887545
H  5.770689 0.712969 2.441872
H  -4.871163 -1.327795 -4.013924
H  -5.814732 -0.870718 -2.579421
H  -4.966952 -2.443205 -2.634556
H  -4.259606 -0.252007 3.756567
H  -5.135009 -1.766147 4.068957
H  -3.394629 -1.805226 3.715581
elementType: Cl S O N C H
totalener: -2434.69226197 hartree
nucrepener: 3012.88440770 hartree
electener: -5447.57666967 hartree
oneelecener: -9339.96818722 hartree
twoeener: 3892.39151755 hartree
cpcmener: -0.04776771 hartree
kineticenergy: 2428.05902584 hartree
xcener: -165.331954404622 hartree
chargesum: -0.0000000
charge: -0.057493 -0.076093 0.868637 -0.269399 -0.479723 -0.499474 -0.280499 0.169982 -0.216636 -0.294173 -0.329551 -0.387517 0.013760 0.233741 0.231675 0.372533 -0.106023 0.059617 -0.075698 -0.267847 -0.151337 0.403606 -0.075695 -0.219685 -0.130296 -0.115518 0.186173 0.141691 0.145583 0.143848 0.108701 0.092278 0.105276 0.132443 0.131395 0.129743 0.115664 0.131084 0.115225
qa: -0.0575 -0.0761 0.8686 -0.2694 -0.4797 -0.4995 -0.2805 0.1700 -0.2166 -0.2942 -0.3296 -0.3875 0.0138 0.2337 0.2317 0.3725 -0.1060 0.0596 -0.0757 -0.2678 -0.1513 0.4036 -0.0757 -0.2197 -0.1303 -0.1155 0.1862 0.1417 0.1456 0.1438 0.1087 0.0923 0.1053 0.1324 0.1314 0.1297 0.1157 0.1311 0.1152
va: 1.2881 1.2530 5.8398 2.1822 2.0172 2.0074 2.1483 3.3143 3.0537 2.8813 2.9898 2.9677 4.2665 3.5660 4.3743 4.0779 4.1255 3.6511 4.0163 3.8791 3.9370 4.0439 3.9399 3.9179 3.8395 3.8441 1.0253 1.0181 0.9963 1.0022 0.9974 1.0058 0.9984 0.9927 0.9859 0.9855 0.9968 0.9932 0.9970
dispcorr: -0.021685023 hartree
energy: -2434.713946992341
dipole: -16.75661 13.89376 -2.86285 -11.05871 6.98061 -4.07810 13.60881 -12.45165 1.15716
magnitude: 5.11526 au
magnitude: 13.00195 debye
