program: Orca
programVersion: 5.0.2
elementType: Cl Cl S O O O O N N N N N C C C C C C C C C C C C C C H H H H H H H H H H H H H
charge: 0
multiplicity: 1
keywords: wb97x-d3
keywords: def2-TZVPP
keywords: def2/J RIJCOSX
keywords: DEFGRID2
keywords: scfconv7
keywords: smallprint printgap noloewdin
keywords: NOSOSCF
formula: C14H13Cl2N5O4S
InChI: InChI=1/C14H13Cl2N5O4S/c1-7-4-5-8(15)12(11(7)16)20-26(22,23)14-18-13-17-9(24-2)6-10(25-3)21(13)19-14/h4-6,20H,1-3H3
39 atoms
Cl 4.170385 1.939846 0.30838
Cl 0.710293 -2.084849 -0.61123
S  0.892557 1.701146 -1.288029
O  -3.746335 -0.742869 -2.419715
O  1.193103 2.695509 -0.285987
O  0.750958 2.023106 -2.691047
O  -4.588104 -1.500776 2.161273
N  -2.367734 -0.075192 -0.786502
N  2.055037 0.525663 -1.213049
N  -1.472153 0.472006 -1.615857
N  -0.837609 0.727482 0.545889
N  -2.706464 -0.390536 1.535355
C  -0.602434 0.922587 -0.751667
C  2.395152 -0.064937 0.01929
C  -1.985643 0.075638 0.522562
C  -3.529292 -0.70191 -1.134813
C  3.343445 0.530591 0.853265
C  3.673997 -0.002958 2.098478
C  1.825223 -1.271406 0.428364
C  -4.286104 -1.189955 -0.110245
C  3.054479 -1.191595 2.468707
C  -3.816477 -1.004191 1.216751
C  2.153572 -1.84028 1.642739
C  4.663864 0.655955 3.006043
C  -4.952079 -1.355469 -2.88119
C  -4.183708 -1.35011 3.520767
H  2.070071 -0.073916 -2.033617
H  -5.218812 -1.704287 -0.288395
H  3.294778 -1.630936 3.428245
H  1.705742 -2.77522 1.949695
H  4.358957 1.671348 3.263272
H  4.764525 0.092987 3.93223
H  5.651612 0.722739 2.547885
H  -5.82717 -0.835176 -2.490235
H  -4.986493 -2.408806 -2.600982
H  -4.933473 -1.269098 -3.963235
H  -3.234888 -1.851197 3.713309
H  -4.09874 -0.299686 3.799696
H  -4.965382 -1.818596 4.112674
elementType: Cl S O N C H
totalener: -2434.69201084 hartree
nucrepener: 3018.58504855 hartree
electener: -5453.27705939 hartree
oneelecener: -9351.39268061 hartree
twoeener: 3898.11562123 hartree
cpcmener: -0.04771779 hartree
kineticenergy: 2428.06396060 hartree
xcener: -165.333036425129 hartree
chargesum: 0.0000000
charge: -0.057194 -0.075307 0.868275 -0.269317 -0.478385 -0.500805 -0.280288 0.170075 -0.218873 -0.291968 -0.330791 -0.388515 0.010574 0.235911 0.235415 0.371656 -0.109447 0.059616 -0.076232 -0.267871 -0.153116 0.402875 -0.072890 -0.219325 -0.130080 -0.115915 0.188049 0.141549 0.145576 0.144149 0.108822 0.092343 0.105135 0.131113 0.130063 0.132573 0.115380 0.115896 0.131272
qa: -0.0572 -0.0753 0.8683 -0.2693 -0.4784 -0.5008 -0.2803 0.1701 -0.2189 -0.2920 -0.3308 -0.3885 0.0106 0.2359 0.2354 0.3717 -0.1094 0.0596 -0.0762 -0.2679 -0.1531 0.4029 -0.0729 -0.2193 -0.1301 -0.1159 0.1880 0.1415 0.1456 0.1441 0.1088 0.0923 0.1051 0.1311 0.1301 0.1326 0.1154 0.1159 0.1313
va: 1.2881 1.2545 5.8419 2.1827 2.0180 2.0053 2.1486 3.3156 3.0524 2.8801 2.9874 2.9673 4.2642 3.5497 4.3708 4.0788 4.1274 3.6499 4.0230 3.8781 3.9395 4.0455 3.9355 3.9173 3.8392 3.8439 1.0236 1.0181 0.9962 1.0024 0.9974 1.0057 0.9986 0.9860 0.9855 0.9927 0.9969 0.9968 0.9932
dispcorr: -0.021804236 hartree
energy: -2434.713815073395
dipole: -17.09997 14.22059 -2.87938 -11.25660 7.16839 -4.08822 14.32459 -13.09360 1.23099
magnitude: 5.14972 au
magnitude: 13.08956 debye
