program: Orca
programVersion: 5.0.2
elementType: Cl Cl S O O O O N N N N N C C C C C C C C C C C C C C H H H H H H H H H H H H H
charge: 0
multiplicity: 1
keywords: wb97x-d3
keywords: def2-TZVPP
keywords: def2/J RIJCOSX
keywords: DEFGRID2
keywords: scfconv7
keywords: smallprint printgap noloewdin
keywords: NOSOSCF
formula: C14H13Cl2N5O4S
InChI: InChI=1/C14H13Cl2N5O4S/c1-7-4-5-8(15)12(11(7)16)20-26(22,23)14-18-13-17-9(24-2)6-10(25-3)21(13)19-14/h4-6,20H,1-3H3
39 atoms
Cl 4.126321 1.956395 0.226734
Cl 0.679523 -2.14367 -0.328253
S  0.835599 1.646672 -1.242045
O  -3.785362 -1.142477 -2.485873
O  1.130057 2.633676 -0.241325
O  0.711764 1.929763 -2.648797
O  -4.585093 -1.852468 2.047417
N  -2.382854 -0.256724 -0.838433
N  1.985742 0.439436 -1.131572
N  -1.471402 0.328092 -1.627231
N  -0.940001 0.623416 0.554635
N  -2.769271 -0.610747 1.478981
C  -0.656801 0.83067 -0.731846
C  2.371474 -0.079251 0.116143
C  -2.046454 -0.087501 0.494261
C  -3.488781 -0.959393 -1.219791
C  3.354794 0.564685 0.870331
C  3.760545 0.085539 2.115176
C  1.833268 -1.265715 0.6146
C  -4.236382 -1.499218 -0.216425
C  3.175344 -1.087072 2.575292
C  -3.818693 -1.298568 1.125878
C  2.232034 -1.775277 1.833905
C  4.803305 0.792748 2.923572
C  -3.652214 -0.088464 -3.449392
C  -4.230402 -1.656054 3.409298
H  1.915081 -0.225752 -1.892089
H  -5.127319 -2.063235 -0.44625
H  3.476318 -1.481257 3.53738
H  1.802545 -2.694955 2.204277
H  4.503463 1.816259 3.149948
H  4.977595 0.276196 3.865869
H  5.752917 0.848746 2.390478
H  -2.628461 0.006358 -3.799111
H  -3.982661 0.86738 -3.041857
H  -4.305662 -0.370471 -4.270294
H  -4.23358 -0.59898 3.67555
H  -4.984003 -2.183595 3.987298
H  -3.243626 -2.063621 3.62907
totalener: -2434.65313442 hartree
nucrepener: 3030.82310044 hartree
electener: -5465.47623486 hartree
oneelecener: -9374.30875378 hartree
twoeener: 3908.83251893 hartree
kineticenergy: 2428.10402693 hartree
xcener: -165.331979119186 hartree
chargesum: 0.0000000
charge: -0.031932 -0.082399 0.842746 -0.272402 -0.415933 -0.442597 -0.262386 0.163896 -0.210575 -0.309830 -0.267148 -0.330814 0.019496 0.204159 0.201301 0.305838 -0.094543 0.050410 -0.050945 -0.260140 -0.123743 0.379575 -0.068042 -0.220419 -0.121776 -0.118925 0.148677 0.133802 0.111485 0.117100 0.111396 0.074333 0.102063 0.134978 0.116698 0.120531 0.113219 0.121433 0.111413
qa: -0.0319 -0.0824 0.8427 -0.2724 -0.4159 -0.4426 -0.2624 0.1639 -0.2106 -0.3098 -0.2671 -0.3308 0.0195 0.2042 0.2013 0.3058 -0.0945 0.0504 -0.0509 -0.2601 -0.1237 0.3796 -0.0680 -0.2204 -0.1218 -0.1189 0.1487 0.1338 0.1115 0.1171 0.1114 0.0743 0.1021 0.1350 0.1167 0.1205 0.1132 0.1214 0.1114
va: 1.3171 1.2504 5.8756 2.1483 2.0866 2.0731 2.1513 3.2649 3.0706 2.7881 2.9910 2.9781 4.2167 3.6361 4.3451 4.0986 4.1708 3.6938 4.0404 3.9198 3.9663 4.0243 3.9901 3.9432 3.8313 3.8649 1.0554 1.0214 1.0057 1.0106 0.9975 1.0076 1.0002 0.9938 0.9920 0.9921 0.9991 0.9919 0.9989
dispcorr: -0.022342268 hartree
energy: -2434.675476692240
dipole: -12.33265 11.00642 -1.32623 -6.69989 4.74343 -1.95646 11.84013 -11.08887 0.75126
magnitude: 2.48012 au
magnitude: 6.30397 debye
