program: Orca
programVersion: 5.0.2
elementType: Cl Cl S O O O O N N N N N C C C C C C C C C C C C C C H H H H H H H H H H H H H
charge: 0
multiplicity: 1
keywords: wb97x-d3
keywords: def2-TZVPP
keywords: def2/J RIJCOSX
keywords: DEFGRID2
keywords: scfconv7
keywords: smallprint printgap noloewdin
keywords: NOSOSCF
formula: C14H13Cl2N5O4S
InChI: InChI=1/C14H13Cl2N5O4S/c1-7-4-5-8(15)12(11(7)16)20-26(22,23)14-18-13-17-9(24-2)6-10(25-3)21(13)19-14/h4-6,20H,1-3H3
39 atoms
Cl 4.109317 1.295598 -1.322624
Cl 0.408236 -1.384063 1.533098
S  0.967116 -0.251191 -2.171985
O  -2.880787 1.994012 1.074318
O  1.207827 1.148172 -2.399526
O  1.051708 -1.265437 -3.186037
O  -5.274067 -1.997881 1.076168
N  -2.160133 0.130009 -0.141694
N  2.002991 -0.739398 -0.945854
N  -1.061224 0.651428 -0.699792
N  -1.328228 -1.503619 -1.341952
N  -3.364685 -1.917109 -0.153541
C  -0.621806 -0.374006 -1.388311
C  2.215783 0.095114 0.163572
C  -2.327811 -1.184147 -0.544972
C  -3.03365 0.74354 0.707661
C  3.16271 1.121388 0.096686
C  3.394257 1.986008 1.166505
C  1.53451 -0.084539 1.368495
C  -4.096986 -0.003615 1.119584
C  2.674209 1.773925 2.335038
C  -4.218094 -1.334713 0.642471
C  1.765633 0.737996 2.454411
C  4.399395 3.090918 1.073816
C  -1.589585 2.5658 1.327157
C  -5.433017 -3.343825 0.649129
H  1.935901 -1.732976 -0.757834
H  -4.824597 0.41416 1.798276
H  2.843949 2.425375 3.182669
H  1.239477 0.570146 3.38363
H  4.422001 3.671473 1.994387
H  5.402981 2.702738 0.897095
H  4.170729 3.769215 0.251502
H  -0.932501 1.864279 1.840752
H  -1.78203 3.416937 1.974564
H  -1.111165 2.892267 0.408927
H  -4.596304 -3.966283 0.966415
H  -6.349381 -3.693291 1.116557
H  -5.521914 -3.412246 -0.434917
totalener: -2434.65235365 hartree
nucrepener: 3072.77734946 hartree
electener: -5507.42970311 hartree
oneelecener: -9457.47863225 hartree
twoeener: 3950.04892914 hartree
kineticenergy: 2428.10856950 hartree
xcener: -165.333684872981 hartree
chargesum: 0.0000000
charge: -0.025053 -0.061217 0.843830 -0.270258 -0.427762 -0.423677 -0.262352 0.167236 -0.204109 -0.323205 -0.247683 -0.332742 0.023848 0.206554 0.193236 0.303105 -0.094378 0.051033 -0.081233 -0.256234 -0.116039 0.376728 -0.120664 -0.219561 -0.101683 -0.118230 0.150979 0.132943 0.116823 0.131604 0.074718 0.105385 0.110415 0.092466 0.122688 0.135921 0.111413 0.121089 0.114068
qa: -0.0251 -0.0612 0.8438 -0.2703 -0.4278 -0.4237 -0.2624 0.1672 -0.2041 -0.3232 -0.2477 -0.3327 0.0238 0.2066 0.1932 0.3031 -0.0944 0.0510 -0.0812 -0.2562 -0.1160 0.3767 -0.1207 -0.2196 -0.1017 -0.1182 0.1510 0.1329 0.1168 0.1316 0.0747 0.1054 0.1104 0.0925 0.1227 0.1359 0.1114 0.1211 0.1141
va: 1.3251 1.2766 5.8646 2.1570 2.0683 2.1001 2.1514 3.2512 3.0715 2.7475 3.0374 2.9814 4.2160 3.6294 4.3456 4.1069 4.1822 3.6827 4.0008 3.9117 3.9340 4.0333 3.9208 3.9443 3.8340 3.8638 1.0526 1.0216 1.0042 1.0091 1.0071 1.0000 0.9982 1.0025 0.9939 0.9941 0.9993 0.9918 0.9987
dispcorr: -0.024212317 hartree
energy: -2434.676565964598
dipole: -10.60478 9.81117 -0.79361 8.06211 -7.30836 0.75375 15.58455 -12.58246 3.00209
magnitude: 3.19539 au
magnitude: 8.12204 debye
