program: Orca
programVersion: 5.0.2
elementType: Cl Cl S O O O O N N N N N C C C C C C C C C C C C C C H H H H H H H H H H H H H
charge: 0
multiplicity: 1
keywords: wb97x-d3
keywords: def2-TZVPP
keywords: def2/J RIJCOSX
keywords: DEFGRID2
keywords: scfconv7
keywords: smallprint printgap noloewdin
keywords: NOSOSCF
formula: C14H13Cl2N5O4S
InChI: InChI=1/C14H13Cl2N5O4S/c1-7-4-5-8(15)12(11(7)16)20-26(22,23)14-18-13-17-9(24-2)6-10(25-3)21(13)19-14/h4-6,20H,1-3H3
39 atoms
Cl 4.175248 1.894151 0.269476
Cl 0.614752 -2.05231 -0.602621
S  0.913129 1.769427 -1.320407
O  -3.736683 -0.702695 -2.434417
O  1.262492 2.743993 -0.325033
O  0.774231 2.062591 -2.722847
O  -4.484762 -1.590827 2.143563
N  -2.3403 -0.039598 -0.806371
N  2.03019 0.521346 -1.238102
N  -1.464473 0.544515 -1.632172
N  -0.805871 0.758406 0.528645
N  -2.637532 -0.42573 1.518394
C  -0.586672 0.993297 -0.769967
C  2.350654 -0.064378 -0.001045
C  -1.934299 0.08603 0.508448
C  -3.489472 -0.682015 -1.148431
C  3.316797 0.514989 0.824265
C  3.635198 -0.017282 2.073475
C  1.753732 -1.251247 0.424935
C  -4.221871 -1.213116 -0.126803
C  2.989772 -1.184776 2.45971
C  -3.733075 -1.050235 1.200547
C  2.070168 -1.817056 1.64282
C  4.645519 0.632595 2.967054
C  -4.930456 -1.325332 -2.873774
C  -4.05106 -1.457292 3.490523
H  1.924003 -0.120239 -2.014993
H  -5.145789 -1.743194 -0.297326
H  3.222546 -1.618813 3.423499
H  1.593048 -2.734861 1.954747
H  4.750368 0.077839 3.897838
H  5.626471 0.68428 2.493887
H  4.355976 1.65442 3.213946
H  -4.945835 -1.215993 -3.953663
H  -5.811867 -0.83887 -2.450626
H  -4.943332 -2.387272 -2.619482
H  -4.799561 -1.966548 4.091281
H  -3.076017 -1.919548 3.644683
H  -3.986975 -0.410891 3.788612
totalener: -2434.65601760 hartree
nucrepener: 3029.20298203 hartree
electener: -5463.85899963 hartree
oneelecener: -9371.24877763 hartree
twoeener: 3907.38977800 hartree
kineticenergy: 2428.10134222 hartree
xcener: -165.331056509160 hartree
chargesum: -0.0000000
charge: -0.031824 -0.086857 0.845351 -0.230581 -0.417766 -0.437491 -0.265325 0.158150 -0.206945 -0.259136 -0.269929 -0.331878 0.006201 0.207258 0.198205 0.347846 -0.108287 0.053245 -0.050864 -0.275247 -0.129246 0.348031 -0.059670 -0.220901 -0.149794 -0.118924 0.147655 0.117027 0.110668 0.115040 0.073679 0.101609 0.111554 0.132219 0.115926 0.114687 0.120809 0.111089 0.114415
qa: -0.0318 -0.0869 0.8454 -0.2306 -0.4178 -0.4375 -0.2653 0.1581 -0.2069 -0.2591 -0.2699 -0.3319 0.0062 0.2073 0.1982 0.3478 -0.1083 0.0532 -0.0509 -0.2752 -0.1292 0.3480 -0.0597 -0.2209 -0.1498 -0.1189 0.1477 0.1170 0.1107 0.1150 0.0737 0.1016 0.1116 0.1322 0.1159 0.1147 0.1208 0.1111 0.1144
va: 1.3169 1.2470 5.8654 2.2045 2.0838 2.0791 2.1474 3.2951 3.0715 2.8175 2.9891 2.9782 4.2124 3.6269 4.3439 4.0631 4.1831 3.6913 4.0403 3.8717 3.9750 4.1104 3.9821 3.9437 3.8769 3.8650 1.0572 1.0274 1.0057 1.0114 1.0075 1.0006 0.9974 0.9961 0.9866 0.9857 0.9920 0.9995 0.9991
dispcorr: -0.022027561 hartree
energy: -2434.678045160769
dipole: -16.87749 14.63416 -2.24333 -11.64123 8.86886 -2.77237 14.36199 -13.45248 0.90951
magnitude: 3.68046 au
magnitude: 9.35499 debye
