program: Orca
programVersion: 5.0.2
elementType: Cl S O O O O O O O N N N N N N N C C C C C C C C C C C C C C C H H H H H H H H H H H H H H H H H H
charge: 0
multiplicity: 1
keywords: wb97x-d3
keywords: def2-TZVPP
keywords: def2/J RIJCOSX
keywords: DEFGRID2
keywords: scfconv7
keywords: smallprint printgap noloewdin
keywords: NOSOSCF
formula: C15H18ClN7O7S
InChI: InChI=1/C15H18ClN7O7S/c1-7-6-29-21-12(30-7)10-11(16)20-23(2)13(10)31(25,26)22-15(24)19-14-17-8(27-3)5-9(18-14)28-4/h5,7,19,22H,6H2,1-4H3
49 atoms
Cl -4.415573 2.02104 0.917911
S  -1.048313 -1.626625 -1.480348
O  -2.010453 2.635679 -1.140672
O  0.636654 2.396654 -0.419785
O  -0.655261 -0.718658 -2.537443
O  -1.473545 -2.970063 -1.799802
O  -0.799085 -2.742224 1.223221
O  5.284005 -0.645361 3.144684
O  4.068963 0.305043 -1.304117
N  -3.476207 -1.435768 -0.150268
N  -4.302833 -0.551207 0.381449
N  0.25517 -1.665785 -0.470288
N  -0.272271 1.404236 -0.150045
N  1.302593 -1.996841 1.574696
N  3.336847 -1.301316 2.315217
N  2.674693 -0.839635 0.097667
C  -2.3362 -0.847615 -0.566848
C  -2.433421 0.50311 -0.289148
C  -1.165176 3.801701 -1.157714
C  -1.475088 1.574553 -0.537589
C  0.240601 3.316634 -1.428011
C  -3.692847 0.609106 0.303514
C  -1.319593 4.580495 0.130665
C  -3.907171 -2.822749 -0.232807
C  0.188739 -2.175029 0.798522
C  2.493528 -1.346821 1.30901
C  4.486631 -0.668161 2.087543
C  3.82406 -0.218366 -0.117753
C  4.800005 -0.095587 0.865014
C  6.528169 0.039221 3.052675
C  3.083443 0.188082 -2.331261
H  -1.51065 4.398807 -2.001639
H  0.958319 4.135417 -1.396404
H  0.296352 2.841912 -2.413636
H  -0.982826 4.020779 1.00358
H  -2.360145 4.86382 0.286503
H  -0.731804 5.496891 0.072071
H  -3.153745 -3.486002 0.177215
H  -4.1282 -3.097742 -1.260365
H  -4.812031 -2.906294 0.358847
H  1.083734 -1.101896 -0.720546
H  1.218936 -2.376341 2.509432
H  5.727627 0.417895 0.662776
H  6.994182 -0.048282 4.030038
H  6.385703 1.095756 2.820008
H  7.18085 -0.414626 2.305371
H  2.167835 0.715754 -2.065937
H  2.856268 -0.853958 -2.555322
H  3.520044 0.654744 -3.209729
elementType: Cl S O N C H
totalener: -2350.80518901 hartree
nucrepener: 3826.44061095 hartree
electener: -6177.24579996 hartree
twoeener: 4664.12300982 hartree
cpcmener: -0.05357241 hartree
kineticenergy: 2343.34845023 hartree
xcener: -177.127244038171 hartree
chargesum: 0.0000000
charge: -0.032144 0.885886 -0.313058 -0.263203 -0.503473 -0.492427 -0.494394 -0.291963 -0.294158 0.182573 -0.288823 -0.187695 -0.197589 -0.130820 -0.395044 -0.433210 -0.071743 -0.044370 0.200318 0.222035 -0.008770 0.078217 -0.300136 -0.155349 0.393475 0.385340 0.391092 0.376233 -0.298829 -0.129274 -0.105863 0.104231 0.118836 0.119027 0.099642 0.097075 0.104165 0.126143 0.134942 0.119472 0.233727 0.191879 0.141078 0.128162 0.123942 0.124331 0.087822 0.121679 0.141012
qa: -0.0321 0.8859 -0.3131 -0.2632 -0.5035 -0.4924 -0.4944 -0.2920 -0.2942 0.1826 -0.2888 -0.1877 -0.1976 -0.1308 -0.3950 -0.4332 -0.0717 -0.0444 0.2003 0.2220 -0.0088 0.0782 -0.3001 -0.1553 0.3935 0.3853 0.3911 0.3762 -0.2988 -0.1293 -0.1059 0.1042 0.1188 0.1190 0.0996 0.0971 0.1042 0.1261 0.1349 0.1195 0.2337 0.1919 0.1411 0.1282 0.1239 0.1243 0.0878 0.1217 0.1410
va: 1.2835 5.8671 2.1322 1.9209 1.9858 2.0075 2.0163 2.1005 2.1420 3.3745 2.8776 3.0973 2.8963 3.1947 2.9794 2.9619 4.0260 3.6989 3.8562 4.1866 3.9058 4.2742 3.9626 3.8488 4.3764 4.2248 4.1530 4.0712 3.8446 3.8530 3.8441 0.9942 0.9930 0.9982 1.0052 1.0108 1.0073 1.0029 0.9902 1.0073 1.0407 1.0186 1.0171 0.9937 0.9865 0.9856 0.9930 0.9951 0.9946
dispcorr: -0.030573241 hartree
energy: -2350.835762250535
dipole: 24.91034 -21.80479 3.10555 10.93894 -8.23108 2.70786 -2.89730 2.32660 -0.57070
magnitude: 4.15965 au
magnitude: 10.57298 debye
