program: Orca
programVersion: 5.0.2
elementType: Cl S O O O O O O O N N N N N N N C C C C C C C C C C C C C C C H H H H H H H H H H H H H H H H H H
charge: 0
multiplicity: 1
keywords: wb97x-d3
keywords: def2-TZVPP
keywords: def2/J RIJCOSX
keywords: DEFGRID2
keywords: scfconv7
keywords: smallprint printgap noloewdin
keywords: NOSOSCF
formula: C15H18ClN7O7S
InChI: InChI=1/C15H18ClN7O7S/c1-7-6-29-21-12(30-7)10-11(16)20-23(2)13(10)31(25,26)22-15(24)19-14-17-8(27-3)5-9(18-14)28-4/h5,7,19,22H,6H2,1-4H3
49 atoms
Cl -4.291361 2.022007 0.963677
S  -1.093955 -1.715396 -1.515631
O  -1.798183 2.543259 -1.090117
O  0.771785 2.195104 -0.16539
O  -0.715914 -0.815385 -2.58532
O  -1.541521 -3.055456 -1.815975
O  -0.815592 -2.804159 1.186863
O  5.124937 -0.356888 3.128089
O  3.935103 0.395176 -1.366691
N  -3.516869 -1.450516 -0.185241
N  -4.304102 -0.541562 0.364966
N  0.230374 -1.761771 -0.533965
N  -0.19591 1.240892 0.031165
N  1.254901 -1.975305 1.537296
N  3.227706 -1.13447 2.290155
N  2.590133 -0.795192 0.043811
C  -2.346284 -0.908354 -0.576613
C  -2.378733 0.43658 -0.261155
C  -0.897465 3.666595 -1.067884
C  -1.356342 1.462025 -0.449346
C  0.500752 3.111627 -1.217101
C  -3.636845 0.589058 0.322975
C  -1.113022 4.485903 0.185911
C  -4.004529 -2.815794 -0.297608
C  0.159256 -2.220101 0.7552
C  2.41021 -1.264489 1.270244
C  4.346111 -0.447968 2.060916
C  3.699217 -0.104684 -0.168487
C  4.646479 0.10823 0.827507
C  6.348065 0.363365 3.027392
C  2.994446 0.160988 -2.414888
H  -1.147141 4.256671 -1.949811
H  1.250529 3.897989 -1.142006
H  0.611538 2.61563 -2.187686
H  -0.479925 5.372537 0.152146
H  -0.87161 3.934215 1.094901
H  -2.147598 4.820825 0.253504
H  -3.289106 -3.514819 0.121152
H  -4.212137 -3.06871 -1.333474
H  -4.925516 -2.868837 0.271612
H  1.039801 -1.168587 -0.782408
H  1.176372 -2.326369 2.48359
H  5.545917 0.669474 0.624762
H  6.80914 0.314376 4.009756
H  6.175886 1.408894 2.767084
H  7.019421 -0.089192 2.295959
H  2.027571 0.612653 -2.194867
H  2.865997 -0.903534 -2.609815
H  3.414933 0.636864 -3.296271
elementType: Cl S O N C H
totalener: -2350.80515379 hartree
nucrepener: 3859.50365653 hartree
electener: -6210.30881032 hartree
twoeener: 4697.07676398 hartree
cpcmener: -0.05454353 hartree
kineticenergy: 2343.36022211 hartree
xcener: -177.129042920177 hartree
chargesum: -0.0000000
charge: -0.032273 0.886090 -0.312625 -0.260456 -0.503654 -0.491373 -0.489657 -0.291835 -0.294393 0.182497 -0.290146 -0.191959 -0.192496 -0.130355 -0.392809 -0.423292 -0.072137 -0.039293 0.207146 0.207049 -0.016357 0.083915 -0.302791 -0.152167 0.387675 0.380190 0.391313 0.371404 -0.300046 -0.129644 -0.102317 0.103561 0.119616 0.119726 0.104372 0.099286 0.097509 0.124544 0.134820 0.119352 0.231581 0.192502 0.141182 0.128045 0.123960 0.124545 0.082445 0.126005 0.141743
qa: -0.0323 0.8861 -0.3126 -0.2605 -0.5037 -0.4914 -0.4897 -0.2918 -0.2944 0.1825 -0.2901 -0.1920 -0.1925 -0.1304 -0.3928 -0.4233 -0.0721 -0.0393 0.2071 0.2070 -0.0164 0.0839 -0.3028 -0.1522 0.3877 0.3802 0.3913 0.3714 -0.3000 -0.1296 -0.1023 0.1036 0.1196 0.1197 0.1044 0.0993 0.0975 0.1245 0.1348 0.1194 0.2316 0.1925 0.1412 0.1280 0.1240 0.1245 0.0824 0.1260 0.1417
va: 1.2839 5.8674 2.1331 1.9204 1.9849 2.0082 2.0197 2.1008 2.1364 3.3754 2.8804 3.0956 2.8982 3.1950 2.9799 2.9603 4.0253 3.6846 3.8497 4.2007 3.9137 4.2699 3.9635 3.8486 4.3834 4.2299 4.1536 4.0654 3.8527 3.8532 3.8416 0.9948 0.9944 0.9927 1.0074 1.0056 1.0104 1.0025 0.9904 1.0074 1.0490 1.0179 1.0171 0.9937 0.9862 0.9859 0.9874 0.9956 0.9942
dispcorr: -0.031577410 hartree
energy: -2350.836731196934
dipole: 24.91716 -21.72745 3.18970 11.27613 -8.45941 2.81672 -3.08095 2.41751 -0.66344
magnitude: 4.30677 au
magnitude: 10.94694 debye
