program: Orca
programVersion: 5.0.2
elementType: Cl S O O O O O O O N N N N N N N C C C C C C C C C C C C C C C H H H H H H H H H H H H H H H H H H
charge: 0
multiplicity: 1
keywords: wb97x-d3
keywords: def2-TZVPP
keywords: def2/J RIJCOSX
keywords: DEFGRID2
keywords: scfconv7
keywords: smallprint printgap noloewdin
keywords: NOSOSCF
formula: C15H18ClN7O7S
InChI: InChI=1/C15H18ClN7O7S/c1-7-6-29-21-12(30-7)10-11(16)20-23(2)13(10)31(25,26)22-15(24)19-14-17-8(27-3)5-9(18-14)28-4/h5,7,19,22H,6H2,1-4H3
49 atoms
Cl -3.986011 2.054248 1.14645
S  -1.147808 -1.826195 -1.553797
O  -1.535564 2.456866 -1.032793
O  0.992701 1.979592 -0.102261
O  -0.810611 -0.972882 -2.674639
O  -1.6486 -3.161931 -1.78052
O  -0.76695 -2.83635 1.156435
O  5.054148 0.202579 2.827866
O  3.806547 0.413331 -1.639107
N  -3.499815 -1.422952 -0.134592
N  -4.199022 -0.481829 0.475626
N  0.228566 -1.882809 -0.64508
N  -0.00919 1.052238 0.064907
N  1.297616 -1.961164 1.41421
N  3.16977 -0.884387 2.124611
N  2.567034 -0.807641 -0.154685
C  -2.311888 -0.949073 -0.561714
C  -2.239822 0.385036 -0.207413
C  -0.509541 3.439643 -1.28129
C  -1.157233 1.349679 -0.402145
C  0.527652 3.317802 -0.192006
C  -3.458276 0.601775 0.436411
C  -1.16211 4.797564 -1.315443
C  -4.076131 -2.753318 -0.246624
C  0.189543 -2.264205 0.672058
C  2.391541 -1.17689 1.100303
C  4.222044 -0.124229 1.853354
C  3.605318 -0.017157 -0.405415
C  4.498579 0.36293 0.58164
C  4.799181 -0.27667 4.14699
C  2.867874 0.064717 -2.656179
H  -0.05826 3.205452 -2.249403
H  0.112446 3.637677 0.770882
H  1.397363 3.93245 -0.419119
H  -1.613049 5.0469 -0.354597
H  -1.93111 4.845144 -2.085518
H  -0.414739 5.55536 -1.548494
H  -3.407106 -3.496655 0.174223
H  -4.300825 -2.993519 -1.281825
H  -4.998529 -2.744217 0.323052
H  1.025469 -1.290065 -0.934927
H  1.234125 -2.239486 2.385512
H  5.349952 0.995743 0.378009
H  5.608034 0.111056 4.76001
H  4.808563 -1.365247 4.189823
H  3.849711 0.092119 4.533711
H  2.807264 -1.01387 -2.798819
H  3.241429 0.523422 -3.56743
H  1.876487 0.462745 -2.440647
elementType: Cl S O N C H
totalener: -2350.80454904 hartree
nucrepener: 3886.46480607 hartree
electener: -6237.26935512 hartree
twoeener: 4724.00211017 hartree
cpcmener: -0.04758723 hartree
kineticenergy: 2343.37210059 hartree
xcener: -177.130130775308 hartree
chargesum: -0.0000000
charge: -0.033105 0.883957 -0.300074 -0.245206 -0.503295 -0.490389 -0.485034 -0.299616 -0.297943 0.181056 -0.289027 -0.193991 -0.200815 -0.134754 -0.424650 -0.417236 -0.062638 -0.019957 0.146971 0.210562 -0.001970 0.086097 -0.270389 -0.150218 0.381127 0.366787 0.426227 0.409219 -0.318860 -0.115615 -0.102293 0.095278 0.107917 0.115219 0.089816 0.102590 0.099108 0.124405 0.134916 0.118815 0.228246 0.194240 0.144192 0.132041 0.114017 0.113612 0.119605 0.140183 0.090871
qa: -0.0331 0.8840 -0.3001 -0.2452 -0.5033 -0.4904 -0.4850 -0.2996 -0.2979 0.1811 -0.2890 -0.1940 -0.2008 -0.1348 -0.4246 -0.4172 -0.0626 -0.0200 0.1470 0.2106 -0.0020 0.0861 -0.2704 -0.1502 0.3811 0.3668 0.4262 0.4092 -0.3189 -0.1156 -0.1023 0.0953 0.1079 0.1152 0.0898 0.1026 0.0991 0.1244 0.1349 0.1188 0.2282 0.1942 0.1442 0.1320 0.1140 0.1136 0.1196 0.1402 0.0909
va: 1.2836 5.8660 2.1501 1.9380 1.9843 2.0084 2.0213 2.1222 2.1221 3.3788 2.8814 3.0900 2.8847 3.1873 2.9637 2.9532 4.0260 3.6767 3.8483 4.1741 3.9212 4.2679 3.9588 3.8475 4.3933 4.2505 4.0097 3.9788 3.9492 3.8490 3.8386 1.0043 1.0003 0.9984 1.0087 1.0042 1.0058 1.0012 0.9906 1.0078 1.0584 1.0150 1.0170 0.9936 0.9953 0.9955 0.9927 0.9933 0.9985
dispcorr: -0.031663130 hartree
energy: -2350.836212174083
dipole: 18.80761 -16.77839 2.02922 10.05096 -7.69463 2.35633 -1.71550 2.22170 0.50619
magnitude: 3.15060 au
magnitude: 8.00818 debye
