program: Orca
programVersion: 5.0.2
elementType: Cl S O O O O O O O N N N N N N N C C C C C C C C C C C C C C C H H H H H H H H H H H H H H H H H H
charge: 0
multiplicity: 1
keywords: wb97x-d3
keywords: def2-TZVPP
keywords: def2/J RIJCOSX
keywords: DEFGRID2
keywords: scfconv7
keywords: smallprint printgap noloewdin
keywords: NOSOSCF
formula: C15H18ClN7O7S
InChI: InChI=1/C15H18ClN7O7S/c1-7-6-29-21-12(30-7)10-11(16)20-23(2)13(10)31(25,26)22-15(24)19-14-17-8(27-3)5-9(18-14)28-4/h5,7,19,22H,6H2,1-4H3
49 atoms
Cl -4.005986 1.7380 -2.183438
S  -1.315043 -1.393564 1.483131
O  -2.131949 2.757887 0.186662
O  0.597729 2.450375 0.289808
O  -1.798466 -2.692478 1.891006
O  -1.160747 -0.341705 2.465512
O  -0.538045 -2.847937 -0.921048
O  3.810075 0.588504 2.03755
O  5.842563 -0.755725 -1.911308
N  -3.393894 -1.461745 -0.353972
N  -4.060809 -0.698811 -1.202763
N  0.175849 -1.538653 0.784344
N  -0.228001 1.406647 -0.044336
N  1.58986 -2.105946 -0.973396
N  2.68036 -0.745837 0.562379
N  3.711658 -1.44197 -1.443603
C  -2.366943 -0.788804 0.203951
C  -2.374192 0.493515 -0.315012
C  -1.295216 3.926298 0.26225
C  -1.485942 1.614488 -0.031991
C  -0.031684 3.519721 0.981653
C  -3.464258 0.470751 -1.187519
C  -2.064067 5.006969 0.975452
C  -3.852755 -2.826177 -0.148141
C  0.35249 -2.206718 -0.397901
C  2.707842 -1.392264 -0.588733
C  3.778169 -0.072571 0.893756
C  4.797746 -0.762132 -1.101011
C  4.899466 -0.041688 0.08268
C  2.668607 0.550772 2.892511
C  5.777312 -1.482536 -3.13628
H  -1.055048 4.238378 -0.758841
H  -0.260196 3.225493 2.012824
H  0.68885 4.336248 1.002133
H  -2.297252 4.722255 2.001918
H  -2.994351 5.23341 0.454946
H  -1.469118 5.919428 1.000764
H  -3.048588 -3.534192 -0.315999
H  -4.638392 -3.004155 -0.874025
H  -4.259008 -2.95115 0.851312
H  0.931564 -0.917543 1.109574
H  1.674844 -2.593792 -1.856528
H  5.791192 0.505293 0.351918
H  2.42833 -0.466503 3.20112
H  1.798601 1.005911 2.419698
H  2.94042 1.133192 3.768543
H  5.62912 -2.548371 -2.965534
H  6.739162 -1.329606 -3.617938
H  4.988195 -1.10656 -3.786663
elementType: Cl S O N C H
totalener: -2350.80547213 hartree
nucrepener: 3818.64772111 hartree
electener: -6169.45319324 hartree
twoeener: 4656.26461039 hartree
cpcmener: -0.04747263 hartree
kineticenergy: 2343.36242827 hartree
xcener: -177.129080882938 hartree
chargesum: 0.0000000
charge: -0.032650 0.888524 -0.308853 -0.259512 -0.492349 -0.501876 -0.494199 -0.297041 -0.298982 0.183090 -0.288690 -0.187944 -0.204786 -0.132695 -0.434079 -0.432826 -0.074605 -0.043399 0.144903 0.253141 0.002873 0.084809 -0.262440 -0.154277 0.392673 0.376007 0.419359 0.424261 -0.324443 -0.104640 -0.114892 0.091913 0.106847 0.122103 0.092796 0.101341 0.095660 0.127271 0.118625 0.134001 0.235425 0.193771 0.145755 0.120291 0.089776 0.140574 0.113456 0.131582 0.114351
qa: -0.0327 0.8885 -0.3089 -0.2595 -0.4923 -0.5019 -0.4942 -0.2970 -0.2990 0.1831 -0.2887 -0.1879 -0.2048 -0.1327 -0.4341 -0.4328 -0.0746 -0.0434 0.1449 0.2531 0.0029 0.0848 -0.2624 -0.1543 0.3927 0.3760 0.4194 0.4243 -0.3244 -0.1046 -0.1149 0.0919 0.1068 0.1221 0.0928 0.1013 0.0957 0.1273 0.1186 0.1340 0.2354 0.1938 0.1458 0.1203 0.0898 0.1406 0.1135 0.1316 0.1144
va: 1.2825 5.8621 2.1453 1.9295 2.0083 1.9878 2.0153 2.1303 2.1223 3.3749 2.8763 3.1043 2.9099 3.1893 2.9581 2.9694 4.0363 3.7051 3.8763 4.1278 3.9003 4.2649 3.9435 3.8478 4.3761 4.2442 3.9966 4.0114 3.9381 3.8419 3.8486 1.0098 0.9994 0.9948 1.0072 1.0056 1.0059 1.0019 1.0077 0.9908 1.0347 1.0161 1.0164 0.9948 0.9941 0.9929 0.9954 0.9937 0.9951
dispcorr: -0.029848266 hartree
energy: -2350.835320394259
dipole: 18.01212 -16.02498 1.98714 8.94516 -7.07175 1.87341 6.88271 -7.10240 -0.21969
magnitude: 2.73982 au
magnitude: 6.96408 debye
