program: Gaussian 09
title: 000073885
version: EM64L-G09RevD.01
frameworkgroup: C1[X(C7H10)]
method: RPBEPBE
basis: SDD
operation: Freq
keyword: #p
keyword: freq=noraman
keyword: PBEPBE/SDD
title: #p freq=noraman PBEPBE/SDD
converged: YES YES NO NO
title: Mulliken charges:
elementType: C C C C C C C H H H H H H H H H H
charge: -0.439525 -0.455175 0.417264 -0.384123 -0.190248 -0.317451 -0.807334 0.207702 0.215719 0.210079 0.217005 0.223190 0.216248 0.218356 0.221753 0.225157 0.221383
chargesum: 0.00000
title: Mulliken charges with hydrogens summed into heavy atoms:
elementType: C C C C C C C
charge: -0.016104 -0.028091 0.417264 -0.160933 0.026000 -0.099094 -0.139041
polarizability: 8.87863223e+01 -1.15377500e+00 7.84366072e+01 8.46094845e-01 -1.18309777e+00 4.68773095e+01
1716.lowfreq: -15.2298 -8.3734 -0.0010 -0.0008 -0.0007 13.0438 143.8837 164.0053 260.2300
frequency: 143.8819 163.9996 260.2285 296.5991 329.8391 440.1289 547.2755 561.3243 659.4068 734.4873 793.3745 804.5575 869.1746 929.7106 953.1662 966.6275 1020.6772 1025.0687 1047.5643 1106.2804 1157.2578 1162.8326 1185.2286 1236.7035 1300.4373 1324.1880 1349.3638 1394.6058 1398.0639 1450.4173 1457.7984 1463.2236 1471.9712 1611.5346 1669.8572 2929.4584 2938.9887 2963.5762 3028.8841 3031.1651 3036.5713 3080.7047 3100.5613 3114.1970 3135.0235
redmass: 2.1142 1.0759 1.9192 2.3025 2.4272 3.4093 3.2254 2.5823 2.2029 1.6343 2.1037 1.2879 2.5288 1.9883 2.0850 1.4892 1.6315 2.0750 1.5325 1.5366 1.2210 1.2520 1.6802 1.3599 1.3786 1.5409 1.6048 1.2332 1.9619 1.0843 1.0976 1.0466 1.0679 7.0786 6.2024 1.0709 1.0651 1.0373 1.0882 1.0945 1.0970 1.0981 1.0850 1.0921 1.0995
irintensity: 1.4814 0.3540 3.6547 4.4604 1.5536 3.1988 8.5418 11.3301 10.5595 39.4877 2.2076 11.7374 2.8942 4.5919 6.9302 2.1268 5.6982 1.7274 11.0130 3.2825 1.8723 5.3912 2.7048 6.5964 0.9188 0.7333 5.7486 11.0300 6.5431 9.1851 9.9269 12.9313 13.0913 0.6429 5.0605 30.8725 57.8412 39.9152 48.8594 32.1706 28.3262 23.0626 9.9080 32.5520 33.4913
temp: 298.150 k
press: 1.00000 atm
elementType: 6 6 6 6 6 6 6 1 1 1 1 1 1 1 1 1 1
symmnumber: 1
zpe: 386668.9 jmol-1
zpe.correction: 0.147274 hartree
zpe.thermalcorrener: 0.154158 hartree
zpe.thermalcorrenthalpy: 0.155102 hartree
zpe.thermalcorrgfe: 0.116842 hartree
zpe.sumelectzpe: -272.177110 hartree
zpe.sumelectthermal: -272.170227 hartree
zpe.sumelectthermalent: -272.169283 hartree
zpe.sumelectthermalfe: -272.207543 hartree
dipole: 0.2047 -0.0736 0.0624
dipole: 0.2263
quadrupole: -39.3766 -40.6923 -45.5438
quadrupole: -0.3369 0.1911 -0.4125
quadrupole: 2.4943 1.1786 -3.6729 -0.3369 0.1911 -0.4125
hfenergy: -272.3243846 hartree
pointgroup: C01 [X(C7H10)]
dipole: -0.0804005 -0.0295028 -0.0243309 debye
dipolederiv: -0.0493541 0.0657782 0.010968 0.0347268 0.0583773 0.0201842 0.0187833 0.064016 0.2015471 0.0664033 -0.0429426 -0.0427814 -0.0305309 -0.0714907 -0.0239827 -0.0773431 0.0055264 0.1747534 0.3199891 -0.06518 -0.0327145 -0.0138492 0.0157872 0.0066233 -0.0556166 0.0353098 -0.0596948 -0.0144044 0.0434453 -0.0693326 -0.0290019 -0.0632798 0.03606 -0.0857304 -0.0784373 -0.2517794 0.0398067 0.0668196 0.0546634 0.1077423 0.017532 0.1006439 0.1446159 0.0411636 -0.1907427 -0.1757769 0.0622644 0.0181686 -0.0271033 0.191487 0.066066 -0.0039531 0.1078272 -0.1895076 -0.1010049 -0.0149126 0.0189843 -0.0287844 0.0367208 0.0001806 0.018033 -0.0086035 0.0984487 0.0065839 -0.0892835 -0.0361806 -0.0953663 -0.1017846 -0.0737753 -0.0681088 -0.1126771 0.047331 -0.0026868 -0.0615544 0.0418485 0.0348606 0.087216 0.0210901 0.0809547 0.0970727 -0.166024 -0.1748091 0.012028 0.0630206 0.0141948 0.0682506 -0.0068685 0.1089713 -0.0050611 0.0678091 0.0756767 0.0102074 -0.0128927 -0.0767922 0.0524408 -0.0135823 -0.0999858 0.0129313 -0.1757192 -0.0291183 0.1026349 0.0256249 0.1017669 -0.0720977 -0.0271051 0.0444265 -0.0370669 0.1582376 0.0144351 0.0862922 0.0029672 0.0731964 -0.1141932 -0.0444298 -0.0022482 -0.0596848 0.1533122 0.0018858 -0.1144142 -0.0359662 -0.0820897 -0.0722104 -0.0549945 -0.0193932 -0.0652005 0.1431979 -0.0200338 -0.0551656 -0.0533589 -0.0641608 0.0633985 -0.0949717 -0.1207573 -0.0879583 -0.0616342 0.0179008 -0.0427245 0.0337488 -0.0650306 0.0202098 0.1267966 0.0949702 0.1197786 -0.0474594 0.024507 0.0367075 0.0132325 0.1462215 -0.1163637 -0.0379349 0.0223816 -0.0289362 0.0979244 unknown
polarizability: 88.7518838|1.3828021|78.3146552|0.0627835|2.6081514|47.0336999 unknown
InChI: InChI=1S/C7H10/c1-7-5-3-2-4-6-7/h3,5-6H,2,4H2,1H3
charge 0 multiplicity 1
17 atoms
C  -1.200536 -1.261768 0.206199
C  -1.885623 0.043512 -0.270233
C  1.007443 -0.063414 0.003065
C  0.302528 -1.236651 -0.040239
C  -1.084559 1.271205 0.138004
C  0.275385 1.201634 0.24837
C  2.512977 0.004893 -0.168822
H  -1.662101 -2.133936 -0.293713
H  -1.38018 -1.396374 1.296715
H  -2.91695 0.098241 0.126046
H  -1.976628 0.035083 -1.379536
H  0.825668 -2.191178 -0.185338
H  -1.61079 2.223454 0.282215
H  0.860023 2.098024 0.496445
H  2.996274 0.445461 0.725713
H  2.789925 0.64549 -1.028869
H  2.949845 -0.995274 -0.333922
