program: Orca
programVersion: 5.0.2
elementType: Cl S O O O O O O O N N N N N N N C C C C C C C C C C C C C C C H H H H H H H H H H H H H H H H H H
charge: 0
multiplicity: 1
keywords: wb97x-d3
keywords: def2-TZVPP
keywords: def2/J RIJCOSX
keywords: DEFGRID2
keywords: scfconv7
keywords: smallprint printgap noloewdin
keywords: NOSOSCF
formula: C15H18ClN7O7S
InChI: InChI=1/C15H18ClN7O7S/c1-7-6-29-21-12(30-7)10-11(16)20-23(2)13(10)31(25,26)22-15(24)19-14-17-8(27-3)5-9(18-14)28-4/h5,7,19,22H,6H2,1-4H3
49 atoms
Cl -3.394698 1.254518 2.841539
S  -1.620466 -1.14489 -1.790791
O  -1.669617 2.602214 0.422507
O  1.001989 1.983997 0.167693
O  -1.54531 0.104703 -2.519195
O  -2.273085 -2.285218 -2.389867
O  -0.57533 -3.144712 0.069461
O  3.264274 1.191081 -2.333971
O  5.397421 -0.317619 1.49993
N  -3.404957 -1.496925 0.311198
N  -3.862961 -0.89315 1.394652
N  -0.05215 -1.507911 -1.410504
N  0.050735 1.0076 0.316404
N  1.508644 -2.282031 0.132494
N  2.397879 -0.56743 -1.15612
N  3.45343 -1.315288 0.817102
C  -2.391539 -0.801984 -0.242468
C  -2.178724 0.321754 0.533402
C  -0.684095 3.639913 0.580029
C  -1.169804 1.36784 0.398632
C  0.505972 3.243873 -0.264385
C  -3.141698 0.195459 1.535718
C  -0.364529 3.843691 2.045818
C  -4.014816 -2.752071 -0.096106
C  0.241438 -2.363218 -0.377157
C  2.493244 -1.335565 -0.087665
C  3.332726 0.36508 -1.304351
C  4.398417 -0.401552 0.636621
C  4.391157 0.497283 -0.422154
C  2.194395 1.045881 -3.265479
C  5.443886 -1.219597 2.602489
H  -1.13978 4.539011 0.165707
H  1.325832 3.952036 -0.153618
H  0.224544 3.197751 -1.322198
H  0.097228 2.967508 2.501863
H  -1.266493 4.084998 2.607213
H  0.325774 4.680338 2.152859
H  -3.258379 -3.515509 -0.240754
H  -4.596909 -2.624723 -1.0042
H  -4.674217 -3.057153 0.708507
H  0.671469 -0.81512 -1.662809
H  1.676235 -2.898134 0.918553
H  5.159017 1.246198 -0.549642
H  1.223221 1.214258 -2.799249
H  2.203727 0.064556 -3.739877
H  2.359355 1.807349 -4.022545
H  6.343309 -0.960032 3.154219
H  5.514045 -2.256201 2.274175
H  4.579246 -1.104106 3.255248
elementType: Cl S O N C H
totalener: -2350.80317334 hartree
nucrepener: 3916.04422207 hartree
electener: -6266.84739541 hartree
twoeener: 4753.52861767 hartree
cpcmener: -0.04708427 hartree
kineticenergy: 2343.37020821 hartree
xcener: -177.131301343529 hartree
chargesum: -0.0000000
charge: -0.031643 0.892576 -0.313855 -0.251677 -0.502573 -0.491051 -0.483656 -0.298885 -0.300143 0.184347 -0.291442 -0.196473 -0.188404 -0.139355 -0.420343 -0.422912 -0.081553 -0.039124 0.212630 0.204701 -0.017694 0.082331 -0.304094 -0.151822 0.382629 0.363425 0.410377 0.427696 -0.316795 -0.104719 -0.115867 0.104495 0.117926 0.118318 0.099711 0.096563 0.104360 0.124880 0.134725 0.118895 0.230737 0.194260 0.143481 0.088726 0.125774 0.141013 0.131688 0.113752 0.114061
qa: -0.0316 0.8926 -0.3139 -0.2517 -0.5026 -0.4911 -0.4837 -0.2989 -0.3001 0.1843 -0.2914 -0.1965 -0.1884 -0.1394 -0.4203 -0.4229 -0.0816 -0.0391 0.2126 0.2047 -0.0177 0.0823 -0.3041 -0.1518 0.3826 0.3634 0.4104 0.4277 -0.3168 -0.1047 -0.1159 0.1045 0.1179 0.1183 0.0997 0.0966 0.1044 0.1249 0.1347 0.1189 0.2307 0.1943 0.1435 0.0887 0.1258 0.1410 0.1317 0.1138 0.1141
va: 1.2847 5.8566 2.1348 1.9296 1.9862 2.0083 2.0229 2.1144 2.1209 3.3734 2.8813 3.0883 2.9050 3.1875 2.9505 2.9637 4.0276 3.6888 3.8550 4.2030 3.9201 4.2741 3.9642 3.8465 4.3890 4.2503 3.9719 4.0053 3.9612 3.8385 3.8498 0.9942 0.9948 0.9945 1.0054 1.0110 1.0078 1.0036 0.9900 1.0076 1.0516 1.0151 1.0170 0.9911 0.9955 0.9924 0.9937 0.9952 0.9953
dispcorr: -0.032854012 hartree
energy: -2350.836027351942
dipole: 19.98490 -17.72048 2.26442 8.52937 -6.55950 1.96986 -1.63934 2.20254 0.56320
magnitude: 3.05371 au
magnitude: 7.76192 debye
