program: Orca
programVersion: 5.0.2
elementType: Cl S O O O O O O O N N N N N N N C C C C C C C C C C C C C C C H H H H H H H H H H H H H H H H H H
charge: 0
multiplicity: 1
keywords: wb97x-d3
keywords: def2-TZVPP
keywords: def2/J RIJCOSX
keywords: DEFGRID2
keywords: scfconv7
keywords: smallprint printgap noloewdin
keywords: NOSOSCF
formula: C15H18ClN7O7S
InChI: InChI=1/C15H18ClN7O7S/c1-7-6-29-21-12(30-7)10-11(16)20-23(2)13(10)31(25,26)22-15(24)19-14-17-8(27-3)5-9(18-14)28-4/h5,7,19,22H,6H2,1-4H3
49 atoms
Cl -3.907391 2.074312 1.087261
S  -1.123122 -1.901102 -1.520009
O  -1.437312 2.369111 -1.14297
O  1.044801 1.938257 -0.032701
O  -0.771168 -1.078683 -2.659238
O  -1.631068 -3.238421 -1.718537
O  -0.780566 -2.844482 1.2202
O  4.760638 0.622704 2.941654
O  3.77475 0.402723 -1.589874
N  -3.484251 -1.433045 -0.134271
N  -4.171053 -0.469089 0.455476
N  0.241467 -1.938814 -0.591401
N  0.017345 1.046731 0.142754
N  1.263874 -1.925186 1.493708
N  3.0095 -0.659562 2.221953
N  2.554039 -0.813546 -0.0871
C  -2.28501 -0.988162 -0.558927
C  -2.190966 0.349908 -0.227868
C  -0.479299 3.444856 -1.110354
C  -1.096502 1.300474 -0.422999
C  0.893285 2.812686 -1.141899
C  -3.409541 0.59921 0.40373
C  -0.725937 4.331136 0.091274
C  -4.080689 -2.755647 -0.228908
C  0.178774 -2.275307 0.73793
C  2.321783 -1.090119 1.182245
C  4.021117 0.154249 1.949932
C  3.540474 0.039175 -0.340708
C  4.342872 0.559123 0.660655
C  4.43704 0.256944 4.281034
C  2.957502 -0.128961 -2.631552
H  -0.640408 4.00602 -2.030598
H  1.678546 3.562148 -1.053166
H  1.038263 2.264727 -2.079077
H  -1.742774 4.721422 0.081432
H  -0.044572 5.181383 0.057569
H  -0.567946 3.811317 1.036476
H  -4.285342 -3.016132 -1.263103
H  -5.015822 -2.718524 0.318324
H  -3.433907 -3.499665 0.224436
H  1.051313 -1.367828 -0.890626
H  1.170095 -2.147227 2.477077
H  5.154687 1.241016 0.454127
H  4.505913 -0.819321 4.434405
H  3.441572 0.599149 4.562124
H  5.174003 0.75435 4.905393
H  3.324861 0.320125 -3.549994
H  1.908576 0.138197 -2.503342
H  3.050067 -1.212701 -2.702068
elementType: Cl S O N C H
totalener: -2350.80329280 hartree
nucrepener: 3928.39067911 hartree
electener: -6279.19397191 hartree
twoeener: 4765.66246975 hartree
cpcmener: -0.04854576 hartree
kineticenergy: 2343.37625957 hartree
xcener: -177.132411175747 hartree
chargesum: -0.0000000
charge: -0.032179 0.885967 -0.313179 -0.250147 -0.501703 -0.489218 -0.483254 -0.299575 -0.299538 0.183142 -0.291994 -0.200102 -0.178467 -0.138114 -0.421907 -0.418090 -0.070895 -0.034993 0.220630 0.179607 -0.030878 0.087247 -0.307842 -0.150371 0.379878 0.364522 0.429839 0.412909 -0.321080 -0.114973 -0.110642 0.104261 0.119666 0.124917 0.097793 0.104892 0.099161 0.134784 0.118576 0.125134 0.230153 0.194247 0.143650 0.113463 0.113796 0.131575 0.141756 0.086752 0.130822
qa: -0.0322 0.8860 -0.3132 -0.2501 -0.5017 -0.4892 -0.4833 -0.2996 -0.2995 0.1831 -0.2920 -0.2001 -0.1785 -0.1381 -0.4219 -0.4181 -0.0709 -0.0350 0.2206 0.1796 -0.0309 0.0872 -0.3078 -0.1504 0.3799 0.3645 0.4298 0.4129 -0.3211 -0.1150 -0.1106 0.1043 0.1197 0.1249 0.0978 0.1049 0.0992 0.1348 0.1186 0.1251 0.2302 0.1942 0.1436 0.1135 0.1138 0.1316 0.1418 0.0868 0.1308
va: 1.2846 5.8623 2.1315 1.9277 1.9845 2.0102 2.0217 2.1222 2.1120 3.3790 2.8842 3.0842 2.8933 3.1865 2.9608 2.9546 4.0197 3.6847 3.8483 4.2175 3.9213 4.2688 3.9645 3.8475 4.3963 4.2462 4.0057 3.9666 3.9557 3.8492 3.8403 0.9945 0.9960 0.9882 1.0105 1.0076 1.0061 0.9909 1.0079 1.0008 1.0580 1.0150 1.0171 0.9953 0.9957 0.9937 0.9923 0.9877 0.9945
dispcorr: -0.033512470 hartree
energy: -2350.836805269073
dipole: 19.68112 -17.51116 2.16996 8.69586 -6.51348 2.18238 0.04998 0.06092 0.11090
magnitude: 3.07958 au
magnitude: 7.82768 debye
