program: Orca
programVersion: 5.0.2
elementType: Cl S O O O O O O O N N N N N N N C C C C C C C C C C C C C C C H H H H H H H H H H H H H H H H H H
charge: 0
multiplicity: 1
keywords: wb97x-d3
keywords: def2-TZVPP
keywords: def2/J RIJCOSX
keywords: DEFGRID2
keywords: scfconv7
keywords: smallprint printgap noloewdin
keywords: NOSOSCF
formula: C15H18ClN7O7S
InChI: InChI=1/C15H18ClN7O7S/c1-7-6-29-21-12(30-7)10-11(16)20-23(2)13(10)31(25,26)22-15(24)19-14-17-8(27-3)5-9(18-14)28-4/h5,7,19,22H,6H2,1-4H3
49 atoms
Cl -3.938836 2.073924 1.082639
S  -1.12958 -1.88672 -1.530798
O  -1.491387 2.416383 -1.092675
O  1.043606 1.932269 -0.138117
O  -0.784035 -1.061284 -2.669716
O  -1.639765 -3.223301 -1.730219
O  -0.771096 -2.858415 1.194546
O  4.791658 0.565915 2.935686
O  3.802304 0.3892 -1.597426
N  -3.486185 -1.430332 -0.136628
N  -4.180007 -0.470149 0.451068
N  0.24127 -1.933024 -0.612052
N  0.022223 1.037503 0.059395
N  1.272781 -1.940466 1.470022
N  3.02847 -0.694591 2.206746
N  2.567191 -0.823512 -0.103193
C  -2.289325 -0.978066 -0.561206
C  -2.205118 0.361855 -0.231421
C  -0.518793 3.480382 -1.093713
C  -1.118989 1.319007 -0.434946
C  0.841491 2.832621 -1.218041
C  -3.426331 0.603461 0.398651
C  -0.683764 4.344446 0.137907
C  -4.078322 -2.755273 -0.230844
C  0.18523 -2.282222 0.714549
C  2.335509 -1.109606 1.163964
C  4.048098 0.111049 1.940534
C  3.563748 0.019336 -0.350773
C  4.3735 0.521657 0.653874
C  4.454746 0.206214 4.273602
C  2.972656 -0.118308 -2.641375
H  -0.726765 4.062436 -1.991658
H  1.640216 3.570654 -1.158345
H  0.926668 2.302609 -2.173257
H  -0.484673 3.801087 1.062036
H  -1.692047 4.753642 0.191567
H  0.011147 5.182725 0.084725
H  -5.010701 -2.721452 0.321136
H  -3.4273 -3.498106 0.218015
H  -4.287509 -3.014731 -1.26436
H  1.044729 -1.354617 -0.910043
H  1.181034 -2.174709 2.450755
H  5.192743 1.195971 0.451744
H  4.505775 -0.870913 4.42852
H  3.463051 0.56448 4.548409
H  5.195688 0.692543 4.902073
H  3.036189 -1.203926 -2.714646
H  3.353445 0.322726 -3.558363
H  1.930941 0.176728 -2.513191
elementType: Cl S O N C H
totalener: -2350.80342036 hartree
nucrepener: 3921.22751476 hartree
electener: -6272.03093512 hartree
twoeener: 4758.55033750 hartree
cpcmener: -0.04827247 hartree
kineticenergy: 2343.36590412 hartree
xcener: -177.130329735464 hartree
chargesum: 0.0000000
charge: -0.032344 0.886829 -0.313862 -0.250531 -0.501901 -0.489966 -0.483773 -0.299836 -0.299609 0.183001 -0.291531 -0.197432 -0.184390 -0.138833 -0.422859 -0.418551 -0.074491 -0.038089 0.218294 0.194644 -0.028491 0.085781 -0.306761 -0.150686 0.381188 0.365520 0.428022 0.411312 -0.319674 -0.115029 -0.106937 0.104068 0.119353 0.123327 0.099459 0.098042 0.104132 0.118573 0.125299 0.134735 0.230204 0.194255 0.143817 0.113283 0.114085 0.131623 0.129240 0.141468 0.086025
qa: -0.0323 0.8868 -0.3139 -0.2505 -0.5019 -0.4900 -0.4838 -0.2998 -0.2996 0.1830 -0.2915 -0.1974 -0.1844 -0.1388 -0.4229 -0.4186 -0.0745 -0.0381 0.2183 0.1946 -0.0285 0.0858 -0.3068 -0.1507 0.3812 0.3655 0.4280 0.4113 -0.3197 -0.1150 -0.1069 0.1041 0.1194 0.1233 0.0995 0.0980 0.1041 0.1186 0.1253 0.1347 0.2302 0.1943 0.1438 0.1133 0.1141 0.1316 0.1292 0.1415 0.0860
va: 1.2840 5.8628 2.1347 1.9269 1.9847 2.0092 2.0214 2.1217 2.1130 3.3782 2.8828 3.0880 2.8994 3.1871 2.9622 2.9523 4.0228 3.6845 3.8483 4.2092 3.9225 4.2690 3.9644 3.8474 4.3945 4.2465 4.0076 3.9697 3.9576 3.8491 3.8388 0.9946 0.9957 0.9891 1.0060 1.0102 1.0074 1.0079 1.0008 0.9909 1.0555 1.0150 1.0170 0.9953 0.9957 0.9937 0.9949 0.9925 0.9882
dispcorr: -0.033204228 hartree
energy: -2350.836624587967
dipole: 19.82140 -17.69209 2.12931 8.70746 -6.48975 2.21771 0.16252 -0.00340 0.15912
magnitude: 3.07856 au
magnitude: 7.82507 debye
