program: Orca
programVersion: 5.0.2
elementType: Cl S O O O O O O O N N N N N N N C C C C C C C C C C C C C C C H H H H H H H H H H H H H H H H H H
charge: 0
multiplicity: 1
keywords: wb97x-d3
keywords: def2-TZVPP
keywords: def2/J RIJCOSX
keywords: DEFGRID2
keywords: scfconv7
keywords: smallprint printgap noloewdin
keywords: NOSOSCF
formula: C15H18ClN7O7S
InChI: InChI=1/C15H18ClN7O7S/c1-7-6-29-21-12(30-7)10-11(16)20-23(2)13(10)31(25,26)22-15(24)19-14-17-8(27-3)5-9(18-14)28-4/h5,7,19,22H,6H2,1-4H3
49 atoms
Cl -3.805465 1.717327 -2.28506
S  -1.440254 -1.450887 1.569183
O  -1.889122 2.677138 0.177686
O  0.810619 2.172485 0.097426
O  -1.984589 -2.723257 1.979234
O  -1.287583 -0.375608 2.526111
O  -0.593976 -3.008251 -0.765358
O  3.498858 0.781635 2.10563
O  5.506536 -0.307009 -1.936565
N  -3.457129 -1.456109 -0.340954
N  -4.045054 -0.683493 -1.236987
N  0.068798 -1.659085 0.933314
N  -0.109085 1.18015 -0.132102
N  1.502068 -2.169074 -0.818552
N  2.492886 -0.694001 0.68075
N  3.508296 -1.251966 -1.371668
C  -2.412035 -0.829003 0.234607
C  -2.318894 0.432041 -0.32609
C  -0.969205 3.704422 0.591786
C  -1.342589 1.490297 -0.071126
C  0.325302 3.481067 -0.15689
C  -3.378212 0.447353 -1.235519
C  -0.821778 3.687925 2.098115
C  -4.008528 -2.779786 -0.105181
C  0.26642 -2.329158 -0.246151
C  2.544158 -1.330573 -0.475261
C  3.50415 0.120618 0.963605
C  4.51334 -0.439395 -1.076842
C  4.575018 0.294336 0.102267
C  2.419347 0.584662 3.015814
C  5.44844 -1.020519 -3.168707
H  -1.417189 4.644977 0.268436
H  1.100339 4.16918 0.179253
H  0.176697 3.625576 -1.233245
H  -0.377432 2.761557 2.464885
H  -1.790062 3.815275 2.582109
H  -0.184019 4.514642 2.412503
H  -4.460202 -2.840505 0.880596
H  -3.243148 -3.540825 -0.211557
H  -4.773883 -2.936723 -0.857405
H  0.813006 -1.01077 1.238022
H  1.615981 -2.651793 -1.700884
H  5.398126 0.955858 0.330044
H  2.64294 1.2127 3.874353
H  2.351148 -0.453468 3.342991
H  1.465821 0.896797 2.589575
H  4.57815 -0.735293 -3.76048
H  5.437531 -2.099327 -3.011733
H  6.351729 -0.747298 -3.708237
elementType: Cl S O N C H
totalener: -2350.80490935 hartree
nucrepener: 3887.18977923 hartree
electener: -6237.99468858 hartree
twoeener: 4724.69541945 hartree
cpcmener: -0.03939654 hartree
kineticenergy: 2343.38828459 hartree
xcener: -177.132598803570 hartree
chargesum: -0.0000000
charge: -0.034868 0.880504 -0.304730 -0.239792 -0.481046 -0.494817 -0.463238 -0.288940 -0.291194 0.181294 -0.285814 -0.190439 -0.192019 -0.140848 -0.416969 -0.427540 -0.079179 -0.033567 0.185031 0.210547 -0.009435 0.081551 -0.290054 -0.153344 0.372990 0.364898 0.411048 0.419553 -0.318989 -0.091106 -0.115896 0.100037 0.107253 0.115160 0.091570 0.102838 0.097603 0.132947 0.125746 0.117750 0.225681 0.190287 0.142419 0.137958 0.123704 0.069897 0.112996 0.112211 0.130351
qa: -0.0349 0.8805 -0.3047 -0.2398 -0.4810 -0.4948 -0.4632 -0.2889 -0.2912 0.1813 -0.2858 -0.1904 -0.1920 -0.1408 -0.4170 -0.4275 -0.0792 -0.0336 0.1850 0.2105 -0.0094 0.0816 -0.2901 -0.1533 0.3730 0.3649 0.4110 0.4196 -0.3190 -0.0911 -0.1159 0.1000 0.1073 0.1152 0.0916 0.1028 0.0976 0.1329 0.1257 0.1178 0.2257 0.1903 0.1424 0.1380 0.1237 0.0699 0.1130 0.1122 0.1304
va: 1.2805 5.8780 2.1414 1.9478 2.0214 1.9963 2.0511 2.1347 2.1316 3.3742 2.8760 3.0868 2.8872 3.1838 2.9548 2.9648 4.0608 3.7026 3.8366 4.1752 3.9457 4.2673 3.9797 3.8499 4.4006 4.2580 3.9873 4.0198 3.9458 3.8483 3.8529 0.9977 0.9942 0.9997 0.9956 1.0088 1.0075 0.9911 1.0023 1.0078 1.0558 1.0179 1.0173 0.9942 0.9954 0.9936 0.9959 0.9957 0.9938
dispcorr: -0.031903525 hartree
energy: -2350.836812872608
dipole: 19.94576 -17.89124 2.05453 7.22228 -5.25016 1.97212 8.01485 -8.43465 -0.41980
magnitude: 2.87864 au
magnitude: 7.31692 debye
