program: Orca
programVersion: 5.0.2
elementType: Cl S O O O O O O O N N N N N N N C C C C C C C C C C C C C C C H H H H H H H H H H H H H H H H H H
charge: 0
multiplicity: 1
keywords: wb97x-d3
keywords: def2-TZVPP
keywords: def2/J RIJCOSX
keywords: DEFGRID2
keywords: scfconv7
keywords: smallprint printgap noloewdin
keywords: NOSOSCF
formula: C15H18ClN7O7S
InChI: InChI=1/C15H18ClN7O7S/c1-7-6-29-21-12(30-7)10-11(16)20-23(2)13(10)31(25,26)22-15(24)19-14-17-8(27-3)5-9(18-14)28-4/h5,7,19,22H,6H2,1-4H3
49 atoms
Cl -4.672178 1.628793 -1.815738
S  -1.23242 -1.297919 1.354241
O  -0.701485 1.697283 0.07771
O  -2.098534 3.91022 0.911643
O  -1.538438 -2.655964 1.737762
O  -1.120184 -0.263709 2.360655
O  -0.412823 -2.566354 -1.176138
O  3.862953 0.496872 2.240559
O  6.18709 -1.006621 -1.485144
N  -3.350752 -1.569125 -0.412117
N  -4.198022 -0.859779 -1.134477
N  0.210959 -1.235515 0.547999
N  -2.736141 2.734793 0.613809
N  1.735402 -1.885464 -1.079768
N  2.777022 -0.661846 0.598022
N  3.957051 -1.448582 -1.285529
C  -2.438838 -0.776071 0.185877
C  -2.720859 0.532508 -0.167426
C  0.023192 2.824593 0.596687
C  -2.025722 1.757692 0.213447
C  -0.811429 4.056765 0.336639
C  -3.834747 0.394805 -0.999495
C  1.365293 2.87135 -0.086038
C  -3.560241 -3.004382 -0.329103
C  0.452766 -1.944364 -0.597295
C  2.86871 -1.300508 -0.555037
C  3.897513 -0.133046 1.081709
C  5.063925 -0.903629 -0.800336
C  5.105578 -0.221966 0.410935
C  2.630542 0.566394 2.954511
C  6.17307 -1.689005 -2.736264
H  0.145123 2.681443 1.675457
H  -0.89461 4.237886 -0.742239
H  -0.36626 4.935408 0.802942
H  1.917499 1.945066 0.067794
H  1.961447 3.683375 0.330416
H  1.263434 3.038238 -1.159256
H  -2.635806 -3.542391 -0.502636
H  -4.272561 -3.26093 -1.10616
H  -3.974402 -3.275731 0.638824
H  0.991215 -0.719746 0.982685
H  1.872543 -2.376208 -1.95481
H  6.016112 0.209421 0.800793
H  2.244017 -0.425041 3.1934
H  1.876135 1.130667 2.40481
H  2.857062 1.090723 3.879436
H  7.193283 -1.639534 -3.108177
H  5.507413 -1.20619 -3.452125
H  5.883642 -2.734097 -2.624009
elementType: Cl S O N C H
totalener: -2350.80640294 hartree
nucrepener: 3814.28608385 hartree
electener: -6165.09248678 hartree
twoeener: 4649.75098272 hartree
cpcmener: -0.04650976 hartree
kineticenergy: 2343.38391174 hartree
xcener: -177.131674132366 hartree
chargesum: -0.0000000
charge: -0.030429 0.872124 -0.303700 -0.249944 -0.479663 -0.492806 -0.475776 -0.289123 -0.289253 0.179492 -0.283203 -0.189925 -0.176225 -0.136495 -0.441306 -0.433373 -0.043759 -0.066672 0.123724 0.241049 0.006186 0.069371 -0.255433 -0.159512 0.391555 0.384751 0.410041 0.416467 -0.314344 -0.096653 -0.116173 0.094953 0.106772 0.115310 0.073777 0.103246 0.100260 0.127409 0.119168 0.134259 0.221946 0.190430 0.142662 0.121028 0.081934 0.139044 0.130641 0.113327 0.112840
qa: -0.0304 0.8721 -0.3037 -0.2499 -0.4797 -0.4928 -0.4758 -0.2891 -0.2893 0.1795 -0.2832 -0.1899 -0.1762 -0.1365 -0.4413 -0.4334 -0.0438 -0.0667 0.1237 0.2410 0.0062 0.0694 -0.2554 -0.1595 0.3916 0.3848 0.4100 0.4165 -0.3143 -0.0967 -0.1162 0.0950 0.1068 0.1153 0.0738 0.1032 0.1003 0.1274 0.1192 0.1343 0.2219 0.1904 0.1427 0.1210 0.0819 0.1390 0.1306 0.1133 0.1128
va: 1.2849 5.8790 2.1301 1.9631 2.0260 1.9983 2.0420 2.1371 2.1347 3.3788 2.8704 3.0908 2.9316 3.1810 2.9376 2.9685 3.9935 3.7622 3.8295 4.1305 3.9584 4.2786 3.9459 3.8510 4.3782 4.2302 3.9887 4.0275 3.9362 3.8475 3.8524 1.0010 0.9988 0.9944 1.0084 1.0065 1.0119 1.0037 1.0068 0.9898 1.0465 1.0184 1.0175 0.9968 0.9828 0.9952 0.9938 0.9955 0.9956
dispcorr: -0.031016852 hartree
energy: -2350.837419787649
dipole: 31.79763 -27.17009 4.62754 1.97824 -1.81387 0.16437 1.98877 -2.86958 -0.88080
magnitude: 4.71349 au
magnitude: 11.98074 debye
