program: Orca
programVersion: 5.0.2
elementType: Cl S O O O O O O O N N N N N N N C C C C C C C C C C C C C C C H H H H H H H H H H H H H H H H H H
charge: 0
multiplicity: 1
keywords: wb97x-d3
keywords: def2-TZVPP
keywords: def2/J RIJCOSX
keywords: DEFGRID2
keywords: scfconv7
keywords: smallprint printgap noloewdin
keywords: NOSOSCF
formula: C15H18ClN7O7S
InChI: InChI=1/C15H18ClN7O7S/c1-7-6-29-21-12(30-7)10-11(16)20-23(2)13(10)31(25,26)22-15(24)19-14-17-8(27-3)5-9(18-14)28-4/h5,7,19,22H,6H2,1-4H3
49 atoms
Cl -3.940723 0.734271 2.793424
S  -1.405803 -0.710152 -1.911613
O  -2.174544 2.629929 0.99464
O  0.528352 2.474165 0.52292
O  -1.286625 0.629233 -2.443762
O  -1.910305 -1.777319 -2.74265
O  -0.499442 -2.993136 -0.305369
O  3.612776 1.497664 -1.831303
O  5.947199 -1.321328 1.021643
N  -3.382184 -1.505319 -0.141996
N  -4.007449 -1.142758 0.963548
N  0.108011 -1.084397 -1.369384
N  -0.278134 1.368088 0.437012
N  1.62281 -2.264314 -0.065063
N  2.594578 -0.350843 -0.956983
N  3.780985 -1.797989 0.478251
C  -2.401787 -0.634974 -0.45697
C  -2.394555 0.357235 0.509302
C  -1.331483 3.736993 1.356631
C  -1.525836 1.521675 0.642994
C  -0.151595 3.714812 0.410774
C  -3.430592 -0.033832 1.362975
C  -0.951967 3.661094 2.820366
C  -3.845872 -2.701449 -0.825392
C  0.35105 -2.169624 -0.57012
C  2.7094 -1.423867 -0.195029
C  3.66834 0.425491 -1.065402
C  4.841661 -1.009789 0.370705
C  4.853055 0.143539 -0.405727
C  2.417099 1.768641 -2.560365
C  5.968607 -2.496497 1.826808
H  -1.929768 4.62972 1.170588
H  0.574582 4.488079 0.659429
H  -0.486979 3.872096 -0.620852
H  -1.840747 3.635796 3.450396
H  -0.380093 4.548645 3.093258
H  -0.343253 2.786364 3.052734
H  -4.589156 -3.156995 -0.179931
H  -3.030618 -3.399963 -0.9788
H  -4.306107 -2.449306 -1.776553
H  0.844722 -0.366736 -1.445246
H  1.774917 -3.068861 0.530489
H  5.726452 0.773381 -0.49355
H  1.577249 1.965596 -1.895297
H  2.164835 0.954073 -3.24028
H  2.625152 2.663422 -3.141386
H  6.964684 -2.535947 2.260473
H  5.800529 -3.395935 1.234045
H  5.230807 -2.450795 2.628118
elementType: Cl S O N C H
totalener: -2350.80631854 hartree
nucrepener: 3834.30238555 hartree
electener: -6185.10870410 hartree
twoeener: 4671.81502289 hartree
cpcmener: -0.03949127 hartree
kineticenergy: 2343.38237000 hartree
xcener: -177.133000155516 hartree
chargesum: -0.0000000
charge: -0.033150 0.877531 -0.308266 -0.252617 -0.491850 -0.482693 -0.470412 -0.289231 -0.290366 0.184115 -0.287686 -0.185722 -0.203986 -0.137357 -0.429583 -0.432918 -0.084469 -0.057357 0.196810 0.255757 -0.014750 0.074964 -0.297192 -0.155274 0.379147 0.373660 0.416514 0.417072 -0.321835 -0.109886 -0.116509 0.100016 0.114807 0.118680 0.096781 0.100670 0.100123 0.117501 0.127270 0.132474 0.230627 0.190070 0.142751 0.090918 0.120212 0.138352 0.130465 0.113036 0.112787
qa: -0.0331 0.8775 -0.3083 -0.2526 -0.4919 -0.4827 -0.4704 -0.2892 -0.2904 0.1841 -0.2877 -0.1857 -0.2040 -0.1374 -0.4296 -0.4329 -0.0845 -0.0574 0.1968 0.2558 -0.0147 0.0750 -0.2972 -0.1553 0.3791 0.3737 0.4165 0.4171 -0.3218 -0.1099 -0.1165 0.1000 0.1148 0.1187 0.0968 0.1007 0.1001 0.1175 0.1273 0.1325 0.2306 0.1901 0.1428 0.0909 0.1202 0.1384 0.1305 0.1130 0.1128
va: 1.2812 5.8850 2.1423 1.9364 2.0010 2.0198 2.0454 2.1402 2.1318 3.3726 2.8745 3.0951 2.8963 3.1821 2.9603 2.9682 4.0352 3.7123 3.8676 4.1534 3.9155 4.2758 3.9613 3.8500 4.3923 4.2496 4.0006 4.0261 3.9349 3.8458 3.8526 0.9939 0.9928 0.9987 1.0111 1.0074 1.0055 1.0078 1.0023 0.9913 1.0414 1.0186 1.0173 0.9954 0.9957 0.9935 0.9936 0.9955 0.9956
dispcorr: -0.030524585 hartree
energy: -2350.836843128530
dipole: 20.40578 -18.41055 1.99523 8.10150 -6.53836 1.56314 0.43489 0.54015 0.97504
magnitude: 2.71571 au
magnitude: 6.90277 debye
