program: Orca
programVersion: 5.0.2
elementType: Cl S O O O O O O O N N N N N N N C C C C C C C C C C C C C C C H H H H H H H H H H H H H H H H H H
charge: 0
multiplicity: 1
keywords: wb97x-d3
keywords: def2-TZVPP
keywords: def2/J RIJCOSX
keywords: DEFGRID2
keywords: scfconv7
keywords: smallprint printgap noloewdin
keywords: NOSOSCF
formula: C15H18ClN7O7S
InChI: InChI=1/C15H18ClN7O7S/c1-7-6-29-21-12(30-7)10-11(16)20-23(2)13(10)31(25,26)22-15(24)19-14-17-8(27-3)5-9(18-14)28-4/h5,7,19,22H,6H2,1-4H3
49 atoms
Cl -3.974132 1.745301 -2.16816
S  -1.32588 -1.447305 1.500879
O  -2.066548 2.769231 0.095311
O  0.634418 2.385166 0.396543
O  -1.814323 -2.758535 1.853082
O  -1.167143 -0.428705 2.514418
O  -0.539982 -2.870128 -0.925122
O  3.783472 0.59839 2.050138
O  5.794469 -0.670655 -1.932976
N  -3.400752 -1.456417 -0.334621
N  -4.051509 -0.684612 -1.186038
N  0.165179 -1.576721 0.797019
N  -0.205561 1.346834 0.087355
N  1.576371 -2.092205 -0.975951
N  2.654401 -0.725413 0.566565
N  3.682296 -1.389166 -1.45061
C  -2.371411 -0.797963 0.235156
C  -2.360012 0.48762 -0.280236
C  -1.205233 3.915126 0.186824
C  -1.451283 1.594133 -0.003982
C  0.002567 3.504947 0.996595
C  -3.443755 0.478445 -1.164046
C  -1.991193 5.034696 0.818767
C  -3.876332 -2.81643 -0.145523
C  0.342116 -2.22668 -0.395671
C  2.682982 -1.364114 -0.589458
C  3.745482 -0.041033 0.896766
C  4.759664 -0.694569 -1.113543
C  4.859373 0.018054 0.075326
C  2.679173 0.487199 2.943936
C  5.725954 -1.402233 -3.153019
H  -0.894201 4.189979 -0.826279
H  -0.292613 3.27067 2.027002
H  0.74784 4.299655 1.019891
H  -2.874904 5.274909 0.227408
H  -1.375818 5.93276 0.872012
H  -2.309294 4.778432 1.830249
H  -3.10489 -3.534459 -0.406564
H  -4.723026 -2.943751 -0.811433
H  -4.202644 -2.975366 0.877884
H  0.907022 -0.938877 1.117338
H  1.671158 -2.568742 -1.864258
H  5.746302 0.573168 0.344652
H  1.770905 0.91634 2.521043
H  2.959886 1.055246 3.827366
H  2.494505 -0.548524 3.231321
H  4.928382 -1.035978 -3.799967
H  5.585628 -2.469273 -2.97825
H  6.683434 -1.244595 -3.643211
elementType: Cl S O N C H
totalener: -2350.80750249 hartree
nucrepener: 3824.27680753 hartree
electener: -6175.08431002 hartree
twoeener: 4661.79884046 hartree
cpcmener: -0.03955793 hartree
kineticenergy: 2343.39291151 hartree
xcener: -177.133237290637 hartree
chargesum: 0.0000000
charge: -0.033441 0.880663 -0.304039 -0.249060 -0.482349 -0.490806 -0.469767 -0.288717 -0.290959 0.185709 -0.288363 -0.185826 -0.205360 -0.136841 -0.429671 -0.432676 -0.084753 -0.047832 0.143195 0.268708 -0.002987 0.081400 -0.261486 -0.155750 0.377899 0.373594 0.414397 0.416930 -0.321938 -0.108934 -0.115722 0.088626 0.105064 0.118406 0.101396 0.093374 0.091896 0.130096 0.117587 0.129923 0.230844 0.190016 0.142934 0.091268 0.138563 0.119590 0.113263 0.111952 0.129983
qa: -0.0334 0.8807 -0.3040 -0.2491 -0.4823 -0.4908 -0.4698 -0.2887 -0.2910 0.1857 -0.2884 -0.1858 -0.2054 -0.1368 -0.4297 -0.4327 -0.0848 -0.0478 0.1432 0.2687 -0.0030 0.0814 -0.2615 -0.1557 0.3779 0.3736 0.4144 0.4169 -0.3219 -0.1089 -0.1157 0.0886 0.1051 0.1184 0.1014 0.0934 0.0919 0.1301 0.1176 0.1299 0.2308 0.1900 0.1429 0.0913 0.1386 0.1196 0.1133 0.1120 0.1300
va: 1.2802 5.8807 2.1523 1.9436 2.0211 2.0026 2.0447 2.1376 2.1314 3.3707 2.8729 3.1009 2.9120 3.1821 2.9557 2.9673 4.0422 3.7082 3.8822 4.1150 3.9144 4.2665 3.9434 3.8502 4.3925 4.2484 4.0029 4.0223 3.9365 3.8467 3.8533 1.0087 0.9988 0.9945 1.0058 1.0063 1.0080 0.9996 1.0084 0.9933 1.0378 1.0187 1.0171 0.9943 0.9931 0.9951 0.9953 0.9959 0.9939
dispcorr: -0.029886051 hartree
energy: -2350.837388542848
dipole: 18.06387 -16.14928 1.91459 9.13187 -7.24968 1.88219 6.37752 -6.65154 -0.27402
magnitude: 2.69878 au
magnitude: 6.85975 debye
