program: Orca
programVersion: 5.0.2
elementType: Cl S O O O O O O O N N N N N N N C C C C C C C C C C C C C C C H H H H H H H H H H H H H H H H H H
charge: 0
multiplicity: 1
keywords: wb97x-d3
keywords: def2-TZVPP
keywords: def2/J RIJCOSX
keywords: DEFGRID2
keywords: scfconv7
keywords: smallprint printgap noloewdin
keywords: NOSOSCF
formula: C15H18ClN7O7S
InChI: InChI=1/C15H18ClN7O7S/c1-7-6-29-21-12(30-7)10-11(16)20-23(2)13(10)31(25,26)22-15(24)19-14-17-8(27-3)5-9(18-14)28-4/h5,7,19,22H,6H2,1-4H3
49 atoms
Cl -3.498277 1.114342 2.871681
S  -1.583361 -1.056582 -1.841422
O  -1.817686 2.647816 0.658741
O  0.81493 2.202539 -0.005361
O  -1.495005 0.201335 -2.548903
O  -2.211685 -2.193808 -2.468688
O  -0.562123 -3.131667 -0.032308
O  3.330372 1.293926 -2.190836
O  5.517167 -0.568331 1.452268
N  -3.380126 -1.512639 0.220583
N  -3.862994 -0.972516 1.325091
N  -0.024967 -1.421181 -1.423396
N  -0.07799 1.17133 0.124146
N  1.529027 -2.292396 0.072535
N  2.427706 -0.503334 -1.105858
N  3.531127 -1.450234 0.750331
C  -2.400876 -0.752306 -0.30743
C  -2.239075 0.352757 0.510806
C  -0.85903 3.707278 0.819578
C  -1.287128 1.453706 0.407699
C  0.225757 3.477092 -0.209868
C  -3.192618 0.140301 1.510859
C  -0.356923 3.754833 2.247066
C  -3.953602 -2.767002 -0.235604
C  0.258144 -2.337511 -0.441493
C  2.538295 -1.368014 -0.11475
C  3.39586 0.398933 -1.223844
C  4.495535 -0.550371 0.616198
C  4.485032 0.429827 -0.368788
C  2.28129 1.202884 -3.150608
C  5.556429 -1.559064 2.474034
H  -1.397866 4.62468 0.580554
H  1.028988 4.207083 -0.114896
H  -0.189101 3.546229 -1.221987
H  -1.1855 3.878382 2.944002
H  0.308052 4.61023 2.370666
H  0.195841 2.858135 2.529841
H  -3.183792 -3.522011 -0.35444
H  -4.49048 -2.632782 -1.170299
H  -4.650162 -3.086853 0.531589
H  0.69597 -0.709996 -1.621379
H  1.698266 -2.959785 0.8151
H  5.275365 1.16009 -0.466206
H  1.298014 1.339555 -2.700674
H  2.306064 0.251485 -3.683435
H  2.459698 2.009288 -3.857225
H  6.477298 -1.377766 3.022681
H  5.579814 -2.567325 2.059606
H  4.710611 -1.469921 3.156272
elementType: Cl S O N C H
totalener: -2350.80479790 hartree
nucrepener: 3891.48934114 hartree
electener: -6242.29413903 hartree
twoeener: 4728.96959280 hartree
cpcmener: -0.03894520 hartree
kineticenergy: 2343.40244447 hartree
xcener: -177.136160800378 hartree
chargesum: 0.0000000
charge: -0.032838 0.884257 -0.309796 -0.242554 -0.492608 -0.481682 -0.463788 -0.290420 -0.291427 0.187190 -0.289494 -0.191730 -0.201846 -0.142272 -0.415986 -0.427350 -0.091293 -0.056203 0.198533 0.249529 -0.017117 0.076246 -0.298570 -0.156537 0.373329 0.363356 0.409028 0.417874 -0.315538 -0.107655 -0.116561 0.100676 0.112818 0.117348 0.096628 0.101006 0.100308 0.128836 0.131660 0.117670 0.229172 0.190163 0.141268 0.087593 0.124506 0.138921 0.129623 0.112553 0.113174
qa: -0.0328 0.8843 -0.3098 -0.2426 -0.4926 -0.4817 -0.4638 -0.2904 -0.2914 0.1872 -0.2895 -0.1917 -0.2018 -0.1423 -0.4160 -0.4274 -0.0913 -0.0562 0.1985 0.2495 -0.0171 0.0762 -0.2986 -0.1565 0.3733 0.3634 0.4090 0.4179 -0.3155 -0.1077 -0.1166 0.1007 0.1128 0.1173 0.0966 0.1010 0.1003 0.1288 0.1317 0.1177 0.2292 0.1902 0.1413 0.0876 0.1245 0.1389 0.1296 0.1126 0.1132
va: 1.2820 5.8785 2.1429 1.9418 2.0002 2.0206 2.0492 2.1257 2.1309 3.3681 2.8740 3.0881 2.9063 3.1814 2.9506 2.9648 4.0346 3.7063 3.8711 4.1575 3.9237 4.2747 3.9621 3.8485 4.3972 4.2587 3.9823 4.0201 3.9579 3.8448 3.8540 0.9935 0.9939 0.9978 1.0111 1.0077 1.0055 1.0021 0.9916 1.0081 1.0482 1.0182 1.0175 0.9939 0.9953 0.9927 0.9942 0.9955 0.9954
dispcorr: -0.031862825 hartree
energy: -2350.836660720267
dipole: 20.39049 -18.23577 2.15472 8.28454 -6.48169 1.80285 -1.01402 1.79642 0.78241
magnitude: 2.91637 au
magnitude: 7.41283 debye
