program: Orca
programVersion: 5.0.2
elementType: Cl S O O O O O O O N N N N N N N C C C C C C C C C C C C C C C H H H H H H H H H H H H H H H H H H
charge: 0
multiplicity: 1
keywords: wb97x-d3
keywords: def2-TZVPP
keywords: def2/J RIJCOSX
keywords: DEFGRID2
keywords: scfconv7
keywords: smallprint printgap noloewdin
keywords: NOSOSCF
formula: C15H18ClN7O7S
InChI: InChI=1/C15H18ClN7O7S/c1-7-6-29-21-12(30-7)10-11(16)20-23(2)13(10)31(25,26)22-15(24)19-14-17-8(27-3)5-9(18-14)28-4/h5,7,19,22H,6H2,1-4H3
49 atoms
Cl -3.996233 1.865336 -2.013968
S  -1.351348 -1.500515 1.510794
O  -1.941446 2.794261 0.124718
O  0.746655 2.26616 0.357053
O  -1.865141 -2.814726 1.816741
O  -1.166859 -0.52864 2.566062
O  -0.61172 -2.818529 -0.991783
O  3.728234 0.500964 2.106274
O  5.692571 -0.517959 -1.974054
N  -3.461375 -1.393696 -0.273708
N  -4.115726 -0.580477 -1.082514
N  0.130096 -1.635588 0.79442
N  -0.161976 1.272795 0.107968
N  1.511525 -2.054427 -1.024666
N  2.602417 -0.765548 0.57322
N  3.600715 -1.295493 -1.496329
C  -2.396493 -0.780702 0.281844
C  -2.361512 0.518009 -0.201961
C  -1.007063 3.885062 0.083183
C  -1.395264 1.583016 0.042652
C  0.203481 3.466865 0.884013
C  -3.472213 0.56262 -1.051628
C  -1.690768 5.107971 0.636531
C  -3.978272 -2.741941 -0.105279
C  0.282597 -2.213671 -0.43823
C  2.617256 -1.335644 -0.618133
C  3.685061 -0.0770 0.92092
C  4.673037 -0.602609 -1.139427
C  4.782065 0.047812 0.084176
C  2.628451 0.336386 2.998651
C  5.607165 -1.174126 -3.235869
H  -0.72073 4.048522 -0.96109
H  -0.067226 3.33318 1.938488
H  0.995369 4.212856 0.819482
H  -2.58828 5.346717 0.06583
H  -1.01971 5.964267 0.568618
H  -1.968878 4.975106 1.682834
H  -3.214028 -3.479617 -0.325819
H  -4.792213 -2.850149 -0.814064
H  -4.360438 -2.888374 0.90109
H  0.888172 -1.024151 1.132689
H  1.592912 -2.480301 -1.9396
H  5.662914 0.606191 0.366399
H  2.455124 -0.713458 3.237292
H  1.71441 0.776653 2.600207
H  2.907516 0.864942 3.906729
H  4.784622 -0.787442 -3.837925
H  5.494723 -2.252877 -3.124464
H  6.547522 -0.964062 -3.739269
elementType: Cl S O N C H
totalener: -2350.80697413 hartree
nucrepener: 3836.08988319 hartree
electener: -6186.89685733 hartree
twoeener: 4673.61080895 hartree
cpcmener: -0.03974267 hartree
kineticenergy: 2343.38421459 hartree
xcener: -177.132103120691 hartree
chargesum: 0.0000000
charge: -0.033505 0.879276 -0.307445 -0.245275 -0.484026 -0.492729 -0.466710 -0.288951 -0.291062 0.185703 -0.288418 -0.183652 -0.205590 -0.137368 -0.423348 -0.431400 -0.087834 -0.046931 0.141162 0.274150 -0.002535 0.078376 -0.259078 -0.152730 0.374503 0.370286 0.412367 0.417722 -0.321697 -0.108062 -0.115925 0.088760 0.105067 0.117215 0.100975 0.094037 0.092033 0.125683 0.117558 0.132414 0.227864 0.190078 0.143003 0.119404 0.092464 0.138557 0.113129 0.112289 0.130198
qa: -0.0335 0.8793 -0.3074 -0.2453 -0.4840 -0.4927 -0.4667 -0.2890 -0.2911 0.1857 -0.2884 -0.1837 -0.2056 -0.1374 -0.4233 -0.4314 -0.0878 -0.0469 0.1412 0.2742 -0.0025 0.0784 -0.2591 -0.1527 0.3745 0.3703 0.4124 0.4177 -0.3217 -0.1081 -0.1159 0.0888 0.1051 0.1172 0.1010 0.0940 0.0920 0.1257 0.1176 0.1324 0.2279 0.1901 0.1430 0.1194 0.0925 0.1386 0.1131 0.1123 0.1302
va: 1.2796 5.8821 2.1495 1.9498 2.0182 1.9999 2.0478 2.1366 2.1315 3.3704 2.8732 3.0977 2.9208 3.1828 2.9561 2.9672 4.0343 3.7051 3.8837 4.1098 3.9163 4.2716 3.9429 3.8498 4.3955 4.2522 4.0004 4.0225 3.9386 3.8455 3.8529 1.0094 0.9979 0.9950 1.0060 1.0061 1.0078 1.0020 1.0080 0.9916 1.0462 1.0184 1.0170 0.9947 0.9943 0.9932 0.9956 0.9958 0.9938
dispcorr: -0.030177352 hartree
energy: -2350.837151484781
dipole: 18.81806 -16.77146 2.04660 9.33870 -7.34867 1.99003 5.04099 -5.47720 -0.43621
magnitude: 2.88774 au
magnitude: 7.34006 debye
